IRIS+ Metrics
type: Vocabulary
type: Ontology
type: ConceptScheme
imports: cids
creator: ac
date: 2025-12-01
version info: 5.3b
description: An codelist vocabulary of IRIS+ Metrics

Operating Expenses
type: Concept
type: Code
has name: Operating Expenses
has description: Value of expenditures incurred by the organization as a result of performing its normal business operations during the reporting period.
definition: Value of expenditures incurred by the organization as a result of performing its normal business operations during the reporting period.
has identifier: FP1001
notation: FP1001
had primary source: FP1001
scope note: This metric is intended to capture the organization’s operating expenses. For financial services organizations, this metric should not include Financial Expenses (FP2553) or provisions for loan losses, which should be reported under Impairment Loss Allowance (FP2392).
defined by: giin

Interest Expenses
type: Concept
type: Code
has name: Interest Expenses
has description: Value of expenditures incurred by the organization during the reporting period as a result of interest incurred on all liabilities, including any client deposit accounts held by the organization, borrowings, and subordinated debt.
definition: Value of expenditures incurred by the organization during the reporting period as a result of interest incurred on all liabilities, including any client deposit accounts held by the organization, borrowings, and subordinated debt.
has identifier: FP1012
notation: FP1012
had primary source: FP1012
scope note: This metric is intended to capture the amount of interest paid by the organization on all liabilities during the reporting period.
defined by: giin

Loans Receivable Net
type: Concept
type: Code
has name: Loans Receivable Net
has description: Net value of the organization's loans receivable as of the end of the reporting period.
definition: Net value of the organization's loans receivable as of the end of the reporting period.
has identifier: FP1129
notation: FP1129
had primary source: FP1129
scope note: This metric is intended to capture the value, as of the end of the reporting period, of loans receivable held by the organization net of loans written down in value.
defined by: giin

Loan to Deposit (LTD) Ratio
type: Concept
type: Code
has name: Loan to Deposit (LTD) Ratio
has description: Ratio between the organization's loans receivable gross and its total deposits as of the end of the reporting period, used to assess an organization's liquidity.
definition: Ratio between the organization's loans receivable gross and its total deposits as of the end of the reporting period, used to assess an organization's liquidity.
has identifier: FP1192
notation: FP1192
had primary source: FP1192
scope note: This metric is intended to capture a measure of a bank or other financial institution’s liquidity: the ratio of loans granted (receivable) to deposits held.
defined by: giin

Net Income
type: Concept
type: Code
has name: Net Income
has description: Value of the organization's net profit, calculated as total income minus total expenses, taxes, and cost of goods sold during the reporting period.
definition: Value of the organization's net profit, calculated as total income minus total expenses, taxes, and cost of goods sold during the reporting period.
has identifier: FP1301
notation: FP1301
had primary source: FP1301
scope note: This metric is intended to capture the organization’s net profit, also sometimes termed bottom line or net earnings.
defined by: giin

Capital Available: Total
type: Concept
type: Code
has name: Capital Available: Total
has description: Value of capital available to the organization for lending and investing as of the end of the reporting period.
definition: Value of capital available to the organization for lending and investing as of the end of the reporting period.
has identifier: FP1307
notation: FP1307
had primary source: FP1307
scope note: This metric is intended to capture the amount of capital the organization can deploy as of the end of the reporting period. This capital can come from debt or equity investments in the organization.
defined by: giin

EBITDA
type: Concept
type: Code
has name: EBITDA
has description: Value of the organization's net income before interest, taxes, depreciation, and amortization during the reporting period. EBITDA signifies Earnings Before Interest, Taxes, Depreciation, and Amortization.
definition: Value of the organization's net income before interest, taxes, depreciation, and amortization during the reporting period. EBITDA signifies Earnings Before Interest, Taxes, Depreciation, and Amortization.
has identifier: FP1657
notation: FP1657
had primary source: FP1657
scope note: This metric is intended to capture the organization’s net income before interest, taxes, depreciation, and amortization during the reporting period, a common measure of business health that normalizes for capital structure (that is, independent of the ratio of debt to equity).
defined by: giin

Impaired Assets
type: Concept
type: Code
has name: Impaired Assets
has description: Value of assets classified as impaired under regulatory or accounting rules and recorded by the organization during the reporting period.
definition: Value of assets classified as impaired under regulatory or accounting rules and recorded by the organization during the reporting period.
has identifier: FP1717
notation: FP1717
had primary source: FP1717
scope note: This metric is intended to capture an organization’s impaired assets, which have market value below their carrying cost and are not expected to recover.
defined by: giin

Total Liabilities
type: Concept
type: Code
has name: Total Liabilities
has description: Value of the organization’s liabilities as of the end of the reporting period.
definition: Value of the organization’s liabilities as of the end of the reporting period.
has identifier: FP1996
notation: FP1996
had primary source: FP1996
scope note: This metric is intended to capture the value of the organization’s total liabilities, which include all debts and other obligations regardless of expected time of settlement.
defined by: giin

Accounts Receivable
type: Concept
type: Code
has name: Accounts Receivable
has description: Value, as of the end of the reporting period, of the organization’s outstanding debts from clients who received goods or services on credit.
definition: Value, as of the end of the reporting period, of the organization’s outstanding debts from clients who received goods or services on credit.
has identifier: FP2213
notation: FP2213
had primary source: FP2213
scope note: This metric is intended to capture the value of accounts receivable by the organization, which are debts clients owe the organization for goods or services provided that the organization expects to receive in the future according to negotiated terms.
defined by: giin

Current Liabilities
type: Concept
type: Code
has name: Current Liabilities
has description: Value, as of the end of the reporting period, of all liabilities that are expected to be settled within one year in the normal course of business.
definition: Value, as of the end of the reporting period, of all liabilities that are expected to be settled within one year in the normal course of business.
has identifier: FP2269
notation: FP2269
had primary source: FP2269
scope note: This metric is intended to capture the organization’s current liabilities, which include accounts payable, lines of credit, and other short-term debts expected to settle within one year.
defined by: giin

Total Expenses
type: Concept
type: Code
has name: Total Expenses
has description: Value of all expenditures incurred by the organization during the reporting period.
definition: Value of all expenditures incurred by the organization during the reporting period.
has identifier: FP2321
notation: FP2321
had primary source: FP2321
scope note: This metric is intended to capture all expenses incurred by the organization. For insurance providers, this metric excludes claims payments.
defined by: giin

Impairment Loss Allowance
type: Concept
type: Code
has name: Impairment Loss Allowance
has description: Value of the organization’s contra asset account set up as a provision for a potential future loss of capital that has been lent out by the organization as of the end of the reporting period.
definition: Value of the organization’s contra asset account set up as a provision for a potential future loss of capital that has been lent out by the organization as of the end of the reporting period.
has identifier: FP2392
notation: FP2392
had primary source: FP2392
scope note: This metric is intended to capture the reduction in the recoverable amount of a fixed asset below its book value.
defined by: giin

Gross Incurred Claims
type: Concept
type: Code
has name: Gross Incurred Claims
has description: Value of the organization’s gross incurred claims as of the end of the reporting period.
definition: Value of the organization’s gross incurred claims as of the end of the reporting period.
has identifier: FP2460
notation: FP2460
had primary source: FP2460
scope note: This metric is intended to capture incurred claims, which occur when an insured event has happened for which the insurer may be liable if a claim is made. An insurer is usually not aware of all incurred claims in real time or for a current accounting period. Incurred claims include all gross paid claims during the period, plus a reasonable estimate of unpaid liabilities. Unpaid liabilities can be calculated as a sum of the change in reserves (including the reserve of claims incurred but not reported), course of settlement reserve, and accrued liabilities reserve. This metric is used in calculating Incurred Claims Ratio (FP8478), which helps assess the value of an insurance product per premium paid.
note: Organizations should footnote all assumptions used. See usage guidance for further information.
defined by: giin

Financial Expenses
type: Concept
type: Code
has name: Financial Expenses
has description: Value of expenditures incurred by the organization during the reporting period to settle interest, fees, and commissions incurred on the organization’s financial liabilities—including, among others, any client deposit accounts held by the organization, borrowings, and subordinated debt.
definition: Value of expenditures incurred by the organization during the reporting period to settle interest, fees, and commissions incurred on the organization’s financial liabilities—including, among others, any client deposit accounts held by the organization, borrowings, and subordinated debt.
has identifier: FP2553
notation: FP2553
had primary source: FP2553
scope note: This metric is intended to capture all costs incurred by the organization during the reporting period that are associated with its financial liabilities, such as interest, fees, and commissions.
defined by: giin

Loans Receivable Gross
type: Concept
type: Code
has name: Loans Receivable Gross
has description: Value of outstanding principal for all of the organization’s outstanding loans due from clients as of the end of the reporting period.
definition: Value of outstanding principal for all of the organization’s outstanding loans due from clients as of the end of the reporting period.
has identifier: FP2630
notation: FP2630
had primary source: FP2630
scope note: This metric is intended to capture principal outstanding owed by clients as of the end of the reporting period. It should include current, delinquent, and renegotiated loans, but not loans that have been written off. It should not include interest receivable.
defined by: giin

Non-Performing Loans (Portfolio at Risk): 30 Days
type: Concept
type: Code
has name: Non-Performing Loans (Portfolio at Risk): 30 Days
has description: Value of the organization’s loans outstanding, as of the end of the reporting period, with one or more installments of principal past due for more than 30 days.
definition: Value of the organization’s loans outstanding, as of the end of the reporting period, with one or more installments of principal past due for more than 30 days.
has identifier: FP2635
notation: FP2635
had primary source: FP2635
scope note: This metric is intended to capture total principal past due by 30 days as of the end of the reporting period. Organizations should report the entire unpaid principal balance, including both past due and future installments, but they should not report accrued interest. This metric should also include loans that have been restructured or rescheduled.
defined by: giin

Capital Available: Borrowed Funds
type: Concept
type: Code
has name: Capital Available: Borrowed Funds
has description: Value of capital available to the organization for lending and investing as of the end of the reporting period that is attributed to debt obligations on the organization’s balance sheet.
definition: Value of capital available to the organization for lending and investing as of the end of the reporting period that is attributed to debt obligations on the organization’s balance sheet.
has identifier: FP2638
notation: FP2638
had primary source: FP2638
scope note: This metric is intended to capture borrowed capital available to the organization for deployment as of the end of the reporting period. This metric should include debt obligations with equity characteristics.
defined by: giin

Return on Equity (ROE)
type: Concept
type: Code
has name: Return on Equity (ROE)
has description: Value of an organization’s net profit generated per dollar of shareholders’ equity during the reporting period. This is a profitability ratio calculated as net income divided by average total equity or net assets.
definition: Value of an organization’s net profit generated per dollar of shareholders’ equity during the reporting period. This is a profitability ratio calculated as net income divided by average total equity or net assets.
has identifier: FP2651
notation: FP2651
had primary source: FP2651
scope note: This metric is intended to capture the profit the organization generated on shareholder’s equity during the reporting period.
defined by: giin

Accounts Payable
type: Concept
type: Code
has name: Accounts Payable
has description: Value, as of the end of the reporting period, of all outstanding debts that must be paid by the organization within a given period of time in order to avoid default.
definition: Value, as of the end of the reporting period, of all outstanding debts that must be paid by the organization within a given period of time in order to avoid default.
has identifier: FP2852
notation: FP2852
had primary source: FP2852
scope note: This metric is intended to capture the value of accounts payable by the organization, which are debts the organization owes that will be paid in the future according to negotiated terms.
defined by: giin

Revenue from Grants and Donations
type: Concept
type: Code
has name: Revenue from Grants and Donations
has description: Value of revenue contributed as grants and donations during the reporting period.
definition: Value of revenue contributed as grants and donations during the reporting period.
has identifier: FP3021
notation: FP3021
had primary source: FP3021
scope note: This metric is intended to capture revenue from both unrestricted and restricted operating grants and donations. It should not include equity grants for capital, grants intended for future operating periods, or grants that will be passed through to other organizations. Organizations should recognize grant revenue on a systematic basis as income over the periods necessary to match them with the related costs which the grants are intended to compensate. If a grant relates to expenses already incurred and no future related costs are expected, the grant should be recognized as income in the period during which it becomes receivable. This metric should include only financial grants and donations received and not the value of in-kind donations.
defined by: giin

Net Income Before Donations
type: Concept
type: Code
has name: Net Income Before Donations
has description: Value of the organization's net profit before donations, calculated as total income (excluding donations) minus total expenses during the reporting period.
definition: Value of the organization's net profit before donations, calculated as total income (excluding donations) minus total expenses during the reporting period.
has identifier: FP3274
notation: FP3274
had primary source: FP3274
scope note: This metric is intended to capture the organization’s income without including donations (such as grant support, philanthropic capital not expecting any repayment, or any form of individual giving) during the reporting period.
defined by: giin

Income Growth
type: Concept
type: Code
has name: Income Growth
has description: Percentage growth in the value of the organization’s net income from one reporting period to another.
definition: Percentage growth in the value of the organization’s net income from one reporting period to another.
has identifier: FP3297
notation: FP3297
had primary source: FP3297
scope note: This metric is intended to capture growth in net income. Organizations receiving substantial revenue from grants/donations under Revenue from Grants and Donations (FP3021) should instead use Net Income Before Donations (FP3274) in this calculation.
defined by: giin

Cash Flow: Net Total
type: Concept
type: Code
has name: Cash Flow: Net Total
has description: Value of the organization’s net cash flow during the reporting period. Net cash flow equals inflows less outflows of cash and cash equivalents from operating, investing, financing, and other activities.
definition: Value of the organization’s net cash flow during the reporting period. Net cash flow equals inflows less outflows of cash and cash equivalents from operating, investing, financing, and other activities.
has identifier: FP3466
notation: FP3466
had primary source: FP3466
scope note: This metric is intended to capture the net cash flow to the organization during the reporting period.
defined by: giin

EBIT
type: Concept
type: Code
has name: EBIT
has description: Value of the organization's net income before interest and taxes during the reporting period. EBIT signifies Earnings Before Interest and Taxes.
definition: Value of the organization's net income before interest and taxes during the reporting period. EBIT signifies Earnings Before Interest and Taxes.
has identifier: FP3673
notation: FP3673
had primary source: FP3673
scope note: This metric is intended to capture the organization’s net income before interest and taxes during the reporting period.
defined by: giin

Charitable Donations
type: Concept
type: Code
has name: Charitable Donations
has description: Value of all financial contributions and in-kind donations of goods and services made by the organization to charities, private foundations, non-profit organizations, or non-governmental organizations during the reporting period.
definition: Value of all financial contributions and in-kind donations of goods and services made by the organization to charities, private foundations, non-profit organizations, or non-governmental organizations during the reporting period.
has identifier: FP3774
notation: FP3774
had primary source: FP3774
note: Organizations should footnote all assumptions used. See usage guidance for further information.
scope note: This metric is intended to capture charitable donations given, not received, by the organization. In-kind donations are in the form of goods and/or services rather than money (e.g., donating food and clothing for natural hazard victims). Pricing discounts (e.g. to non-profits) should not be used as part of this metric; only free services are considered to be in-kind donations. The monetary equivalent of pro bono services provided can be included as in-kind donations; however, "low bono" services are considered to be pricing discounts and should not be included. Organizations are encouraged to footnote their method for calculating the value of in-kind donations. Donations made to organizations that service political causes, despite their non-profit status, should be excluded. Organizations are encouraged to report this metric in conjunction with Community Service Hours Contributed (OI8429), which are not considered in-kind donations, and Charitable Practices (OI7421).
defined by: giin

Loans Recovered
type: Concept
type: Code
has name: Loans Recovered
has description: Value of loans collected by the organization during the reporting period that had previously been written off.
definition: Value of loans collected by the organization during the reporting period that had previously been written off.
has identifier: FP3939
notation: FP3939
had primary source: FP3939
scope note: This metric is intended to capture the value of loans owed the organization that it collected during the reporting period but that it had previously written off as bad debt.
defined by: giin

Working Capital Ratio
type: Concept
type: Code
has name: Working Capital Ratio
has description: Ratio of the organization’s current assets compared to current liabilities as of the end of the reporting period.
definition: Ratio of the organization’s current assets compared to current liabilities as of the end of the reporting period.
has identifier: FP4224
notation: FP4224
had primary source: FP4224
scope note: This metric is intended to capture the organization’s working capital position. This ratio is commonly termed the Current Ratio or Net Working Capital.
defined by: giin

Return on Assets (ROA)
type: Concept
type: Code
has name: Return on Assets (ROA)
has description: Value of an organization’s net profit after taxes generated per dollar invested in total assets as of the end of the reporting period. This is a profitability ratio calculated as net income less taxes, divided by average total assets.
definition: Value of an organization’s net profit after taxes generated per dollar invested in total assets as of the end of the reporting period. This is a profitability ratio calculated as net income less taxes, divided by average total assets.
has identifier: FP4326
notation: FP4326
had primary source: FP4326
scope note: This metric is intended to capture the profit after taxes the organization generated on all assets (that is, on capital in any form).
defined by: giin

Gross Margin
type: Concept
type: Code
has name: Gross Margin
has description: Percentage of revenue that the organization retains after incurring the direct costs associated with the production/delivery of its products/services during the reporting period.
definition: Percentage of revenue that the organization retains after incurring the direct costs associated with the production/delivery of its products/services during the reporting period.
has identifier: FP4373
notation: FP4373
had primary source: FP4373
scope note: This metric is intended to capture gross margin during the reporting period, or the percentage profitability of a sale of products or services that incurs only direct costs (excluding, that is, costs such as operating overheads or research and development).
defined by: giin

Financial Assets
type: Concept
type: Code
has name: Financial Assets
has description: Value, as of the end of the reporting period, of the organization's non-physical assets such as cash, bank accounts, or other investments.
definition: Value, as of the end of the reporting period, of the organization's non-physical assets such as cash, bank accounts, or other investments.
has identifier: FP4649
notation: FP4649
had primary source: FP4649
scope note: This metric is intended to capture the organization’s financial assets, which include debt, equity, and cash assets such as stocks, bonds, mutual funds, cash, and cash management accounts. Values of these assets should be based upon fair market value where efficient secondary markets exist; otherwise, these assets should be valued at historic cost. Financial assets should only include non-current assets.
defined by: giin

Revenue Growth
type: Concept
type: Code
has name: Revenue Growth
has description: Percentage growth in value of the organization's revenue from one reporting period to another.
definition: Percentage growth in value of the organization's revenue from one reporting period to another.
has identifier: FP4761
notation: FP4761
had primary source: FP4761
scope note: This metric is intended to capture the organization’s growth in revenue. Negative values can be interpreted as the percentage decrease in revenue growth between periods.
defined by: giin

Cash Flow: Operating Activities
type: Concept
type: Code
has name: Cash Flow: Operating Activities
has description: Value of the organization's cash flow during the reporting period related to operating activities.
definition: Value of the organization's cash flow during the reporting period related to operating activities.
has identifier: FP4812
notation: FP4812
had primary source: FP4812
scope note: This metric is intended to capture the organization’s cash flow from operating activities during the reporting period, which are the principal revenue-producing activities of the organization and other activities that are not investing or financing activities.
defined by: giin

Personnel Expenses
type: Concept
type: Code
has name: Personnel Expenses
has description: Value of expenditures related to personnel, including wages, benefits, trainings, and payroll taxes, incurred by the organization during the reporting period.
definition: Value of expenditures related to personnel, including wages, benefits, trainings, and payroll taxes, incurred by the organization during the reporting period.
has identifier: FP4831
notation: FP4831
had primary source: FP4831
scope note: This metric is intended to capture the total costs paid by the organization to and on behalf of employees during the reporting period.
defined by: giin

Non-operating Revenue
type: Concept
type: Code
has name: Non-operating Revenue
has description: Value of revenue derived from activities not related to the organization's core operations during the reporting period.
definition: Value of revenue derived from activities not related to the organization's core operations during the reporting period.
has identifier: FP4849
notation: FP4849
had primary source: FP4849
scope note: This metric is intended to capture such items as dividend income, profits (and losses) from investments, gains (and losses) incurred due to foreign exchange, and asset write-downs, among other non-operating revenues and expenses. As an example, for a hospital, in addition to finance-related revenue, non-operating revenue might include parking fees, revenue from the gift shop, cafeteria sales, or rental income.
defined by: giin

Payments to Government
type: Concept
type: Code
has name: Payments to Government
has description: Value of all transfers to governments made by the organization during the reporting period.
definition: Value of all transfers to governments made by the organization during the reporting period.
has identifier: FP5261
notation: FP5261
had primary source: FP5261
scope note: This metric is intended to capture the funds paid to governments by the organization during the reporting period. At a minimum, this metric includes payments to governments in the form of corporate income or profit taxes. Additional forms of transfer to be reported, as relevant, include: (a) sales taxes, (b) net VAT, (c) royalties, (d) dividends and related taxes, (e) management and/or concession fees, (f) license fees, (g) tax on payment of interest, and (h) other material payments net of any direct subsidies received. Organizations should report payroll taxes under Personnel Expenses (FP4831).
defined by: giin

Total Assets
type: Concept
type: Code
has name: Total Assets
has description: Value, as of the end of the reporting period, of all of the organization's assets.
definition: Value, as of the end of the reporting period, of all of the organization's assets.
has identifier: FP5293
notation: FP5293
had primary source: FP5293
scope note: This metric is intended to capture the organization’s total assets, equal to the sum of current assets plus non-current assets.
defined by: giin

Equity or Net Assets
type: Concept
type: Code
has name: Equity or Net Assets
has description: Value of the residual interest, as of the end of the reporting period, in the assets of the organization after deducting all its liabilities.
definition: Value of the residual interest, as of the end of the reporting period, in the assets of the organization after deducting all its liabilities.
has identifier: FP5317
notation: FP5317
had primary source: FP5317
scope note: This metric is intended to capture the organization’s net assets, also sometimes termed stockholders' or shareholders' equity.
defined by: giin

Sales Revenue: Collected from Third Party Payers
type: Concept
type: Code
has name: Sales Revenue: Collected from Third Party Payers
has description: Value of revenue during the reporting period from sales of the organization’s products/services and collected from third-party (public or private) payers.
definition: Value of revenue during the reporting period from sales of the organization’s products/services and collected from third-party (public or private) payers.
has identifier: FP5624
notation: FP5624
had primary source: FP5624
scope note: This metric is intended to capture the organization’s sales revenue collected from third parties. This metric may be useful for organizations that have contracts with governments and other third parties to pay for products or services delivered to end clients. For example, organizations operating in health services would include under this metric revenue from insurance reimbursements and government contracts. Organizations may find it useful to break down this metric into additional subcategories.
defined by: giin

Capital Available: Equity Capital
type: Concept
type: Code
has name: Capital Available: Equity Capital
has description: Value of capital available to the organization for lending and investing at the end of the reporting period that is attributed to equity contributions.
definition: Value of capital available to the organization for lending and investing at the end of the reporting period that is attributed to equity contributions.
has identifier: FP5662
notation: FP5662
had primary source: FP5662
scope note: This metric is intended to capture equity capital available to the organization for deployment as of the end of the reporting period. Organizations that are nonprofit should report permanent capital, which is calculated as net assets available for lending and investing at the end of a fiscal year.
defined by: giin

Number of Loans Fully Repaid on Time
type: Concept
type: Code
has name: Number of Loans Fully Repaid on Time
has description: Number of the organization’s loans due for complete payback during the reporting period (but disbursed at any time) that were repaid no later than their due dates.
definition: Number of the organization’s loans due for complete payback during the reporting period (but disbursed at any time) that were repaid no later than their due dates.
has identifier: FP5979
notation: FP5979
had primary source: FP5979
scope note: Number of the organization’s loans due for complete payback during the reporting period (but disbursed at any time) that were repaid no later than their due dates.
note: Organizations should footnote all assumptions used.
defined by: giin

Long Term Financial Liabilities
type: Concept
type: Code
has name: Long Term Financial Liabilities
has description: Value, as of the end of the reporting period, of an organization's long-term financial liabilities.
definition: Value, as of the end of the reporting period, of an organization's long-term financial liabilities.
has identifier: FP6094
notation: FP6094
had primary source: FP6094
scope note: This metric is intended to capture the organization’s long-term financial liabilities, which include all borrowed funds, deposits held, and other contractual obligations to deliver cash.
defined by: giin

Solvency Ratio
type: Concept
type: Code
has name: Solvency Ratio
has description: Ratio of an organization’s admitted assets to liabilities, per their statutory accounts, as of the end of the reporting period.
definition: Ratio of an organization’s admitted assets to liabilities, per their statutory accounts, as of the end of the reporting period.
has identifier: FP6152
notation: FP6152
had primary source: FP6152
scope note: This metric is intended to capture the financial strength of an insurance program (as a ‘cover ratio’ would for international insurers). This metric is not intended to refer to Solvency I or II rules. The Insurance Information Institute, applicable in the United States, defines admitted assets as those “that can be easily sold in the event of liquidation or borrowed against, and receivables for which payment can be reasonably anticipated.” In the absence of a regulatory definition of admitted assets applicable to their context, organizations should include in this metric higher-quality assets that can easily be liquidated. For more detail and guidance on interpretation, see the Microinsurance Network’s Performance Indicators for Microinsurance (2nd Edition), p. 49 (https://www.social-protection.org/gimi/ShowRessource.action?id=5270/).
note: Organizations should footnote details about their admitted assets. See usage guidance for further information.
defined by: giin

Non-Performing Loans (Portfolio at Risk): 60 Days
type: Concept
type: Code
has name: Non-Performing Loans (Portfolio at Risk): 60 Days
has description: Value of the organization’s loans outstanding, as of the end of the reporting period, with one or more installments of principal past due for more than 60 days.
definition: Value of the organization’s loans outstanding, as of the end of the reporting period, with one or more installments of principal past due for more than 60 days.
has identifier: FP6354
notation: FP6354
had primary source: FP6354
scope note: This metric is intended to capture total principal past due by 60 days as of the end of the reporting period. Organizations should report the entire unpaid principal balance, including both past due and future installments, but they should not report accrued interest. This metric should also include loans that have been restructured or rescheduled.
defined by: giin

Non-Performing Loans (Portfolio at Risk): 90 Days
type: Concept
type: Code
has name: Non-Performing Loans (Portfolio at Risk): 90 Days
has description: Value of the organization’s loans outstanding, as of the end of the reporting period, with one or more installments of principal past due for more than 90 days.
definition: Value of the organization’s loans outstanding, as of the end of the reporting period, with one or more installments of principal past due for more than 90 days.
has identifier: FP6373
notation: FP6373
had primary source: FP6373
scope note: This metric is intended to capture total principal past due by 90 days as of the end of the reporting period. Organizations should report the entire unpaid principal balance, including both past due and future installments, but they should not report accrued interest. This metric should also include loans that have been restructured or rescheduled.
defined by: giin

Cash and Cash Equivalents: Period End
type: Concept
type: Code
has name: Cash and Cash Equivalents: Period End
has description: Value of the organization's cash equivalents as of the end of the reporting period.
definition: Value of the organization's cash equivalents as of the end of the reporting period.
has identifier: FP6462
notation: FP6462
had primary source: FP6462
scope note: This metric is intended to capture the organization’s cash position as of the end of the reporting period.
defined by: giin

Total Revenue
type: Concept
type: Code
has name: Total Revenue
has description: Value of all revenue received by the organization during the reporting period.
definition: Value of all revenue received by the organization during the reporting period.
has identifier: FP6510
notation: FP6510
had primary source: FP6510
scope note: This metric is intended to capture the organization’s total revenue from any source during the reporting period.
defined by: giin

Loans Payable
type: Concept
type: Code
has name: Loans Payable
has description: Value of the remaining balance, as of the end of the reporting period, on all the organization's outstanding debt obligations carried on the balance sheet.
definition: Value of the remaining balance, as of the end of the reporting period, on all the organization's outstanding debt obligations carried on the balance sheet.
has identifier: FP6750
notation: FP6750
had primary source: FP6750
scope note: This metric is intended to capture the organization’s debt obligations, which should include both short- and long-term obligations.
defined by: giin

Working Capital
type: Concept
type: Code
has name: Working Capital
has description: Value of the organization's operating liquidity as of the end of the reporting period.
definition: Value of the organization's operating liquidity as of the end of the reporting period.
has identifier: FP6856
notation: FP6856
had primary source: FP6856
scope note: This metric is intended to capture the organization’s working capital position as of the end of the reporting period, also known as its operating liquidity (ability to meet additional or unexpected debts and obligations).
defined by: giin

Current Assets
type: Concept
type: Code
has name: Current Assets
has description: Value, as of the end of the reporting period, of the organization's assets that the organization reasonably expects to convert into cash within one year in the normal course of business.
definition: Value, as of the end of the reporting period, of the organization's assets that the organization reasonably expects to convert into cash within one year in the normal course of business.
has identifier: FP6926
notation: FP6926
had primary source: FP6926
scope note: This metric is intended to capture the organization’s current assets, which can include cash, accounts receivable, inventory, marketable securities, prepaid expenses, and other liquid assets that can be readily converted to cash.
defined by: giin

Cash and Cash Equivalents: Period Start
type: Concept
type: Code
has name: Cash and Cash Equivalents: Period Start
has description: Value of the organization's cash equivalents as of the beginning of the reporting period.
definition: Value of the organization's cash equivalents as of the beginning of the reporting period.
has identifier: FP7264
notation: FP7264
had primary source: FP7264
scope note: This metric is intended to capture the organization’s cash position as of the beginning of the reporting period.
defined by: giin

Gross Profit
type: Concept
type: Code
has name: Gross Profit
has description: Value of the organization's residual profit after incurring the direct costs associated with the production/delivery of products/services during the reporting period.
definition: Value of the organization's residual profit after incurring the direct costs associated with the production/delivery of products/services during the reporting period.
has identifier: FP7629
notation: FP7629
had primary source: FP7629
scope note: This metric is intended to capture the gross profit from the sale of products or services during the reporting period, accounting only for direct costs of sale (excluding, that is, costs such as operating overheads or research and development).
defined by: giin

Operating Profit Margin
type: Concept
type: Code
has name: Operating Profit Margin
has description: Percentage of the organization's revenue that remains after paying variable costs such as wages and raw materials during the reporting period.
definition: Percentage of the organization's revenue that remains after paying variable costs such as wages and raw materials during the reporting period.
has identifier: FP7897
notation: FP7897
had primary source: FP7897
scope note: This metric is intended to capture the organization’s operating margin. Organizations receiving substantial revenue from grants/donations under Revenue from Grants and Donations (FP3021) should instead use Net Income Before Donations (FP3274) in this calculation.
defined by: giin

Cash Flow: Financing Activities
type: Concept
type: Code
has name: Cash Flow: Financing Activities
has description: Value of the organization's cash flow during the reporting period related to its financing activities.
definition: Value of the organization's cash flow during the reporting period related to its financing activities.
has identifier: FP8244
notation: FP8244
had primary source: FP8244
scope note: This metric is intended to capture the organization’s cash flow from financing activities during the reporting period, which result in changes in the size and composition of the contributed equity and borrowings of the organization. These include activities such as issuing cash dividends, adding or changing loans, or issuing and selling more stock.
defined by: giin

New Investment Capital
type: Concept
type: Code
has name: New Investment Capital
has description: Value of funds invested in the organization (both loans and investments) during the reporting period.
definition: Value of funds invested in the organization (both loans and investments) during the reporting period.
has identifier: FP8293
notation: FP8293
had primary source: FP8293
scope note: This metric is intended to capture capital received by the organization from investors in the form of a loan or cash for stock during the reporting period.
defined by: giin

Personnel Efficiency
type: Concept
type: Code
has name: Personnel Efficiency
has description: Ratio of the organization's personnel expenses compared to its loans receivable as of the end of the reporting period.
definition: Ratio of the organization's personnel expenses compared to its loans receivable as of the end of the reporting period.
has identifier: FP8295
notation: FP8295
had primary source: FP8295
scope note: This metric is intended to capture the organization’s personnel efficiency.
defined by: giin

Sales Revenue: Collected Directly
type: Concept
type: Code
has name: Sales Revenue: Collected Directly
has description: Value of revenue during the reporting period from sales of the organization’s products/services and collected directly from clients.
definition: Value of revenue during the reporting period from sales of the organization’s products/services and collected directly from clients.
has identifier: FP8300
notation: FP8300
had primary source: FP8300
scope note: This metric is intended to capture the organization’s sales revenue collected directly. This metric may be useful for organizations that receive only some revenue directly from end clients. For example, organizations operating in health services will include under this metric all out-of-pocket payments paid at the time of service or purchase.
defined by: giin

Incurred Claims Ratio
type: Concept
type: Code
has name: Incurred Claims Ratio
has description: Percentage of gross incurred claims during the reporting period relative to gross earned premiums during the same reporting period.
definition: Percentage of gross incurred claims during the reporting period relative to gross earned premiums during the same reporting period.
has identifier: FP8478
notation: FP8478
had primary source: FP8478
scope note: This metric is intended to capture the value of products for the insured. As an example, a 70% incurred claims ratio means that for every USD 100 of premium earned in a given accounting period, USD 70 is paid back to insured in the form of benefits (claims). Incurred claims ratios should not be compared across different product types or at different stages of a product’s life cycle. For more detail and for guidance on interpretation, see the Microinsurance Network’s Social Performance Indicators for Microinsurance, p. 16 (https://www.social-protection.org/gimi/ShowRessource.action?id=5270/).
note: Organizations should footnote all assumptions used.
defined by: giin

Operating Efficiency
type: Concept
type: Code
has name: Operating Efficiency
has description: Ratio of the organization's operating expenses compared to its loans receivable as of the end of the reporting period.
definition: Ratio of the organization's operating expenses compared to its loans receivable as of the end of the reporting period.
has identifier: FP8569
notation: FP8569
had primary source: FP8569
scope note: This metric is intended to capture the organization’s operating efficiency.
defined by: giin

Retained Earnings
type: Concept
type: Code
has name: Retained Earnings
has description: Value of the sum of the organization's profits, cumulative from inception to the end of the reporting period, not paid out as dividends but retained by the organization for reinvestment in its core business or to pay down debt.
definition: Value of the sum of the organization's profits, cumulative from inception to the end of the reporting period, not paid out as dividends but retained by the organization for reinvestment in its core business or to pay down debt.
has identifier: FP8653
notation: FP8653
had primary source: FP8653
scope note: This metric is intended to capture the organization’s cumulative earnings recognized in the organization's income statements which have not been paid to the owners of the organization as dividends. Retained earnings is also sometimes termed retained capital, accumulated earnings, or retained surplus. Organizations should report retained earnings as of the end of the reporting period.
defined by: giin

Cost of Goods Sold
type: Concept
type: Code
has name: Cost of Goods Sold
has description: This metric is intended to capture the organization’s operating efficiency. Value of direct expenditures attributable to the production of goods sold by the organization during the reporting period.
definition: This metric is intended to capture the organization’s operating efficiency. Value of direct expenditures attributable to the production of goods sold by the organization during the reporting period.
has identifier: FP9049
had primary source: FP9049
scope note: This metric is intended to capture all costs of purchase, costs of conversion, and other direct costs incurred in the production and sale of the organization's products.
defined by: giin

Total Deposits
type: Concept
type: Code
has name: Total Deposits
has description: Value of the organization’s customer deposits, whether voluntary, compulsory, demand, or term, as well as all other liabilities from customers as of the end of the reporting period.
definition: Value of the organization’s customer deposits, whether voluntary, compulsory, demand, or term, as well as all other liabilities from customers as of the end of the reporting period.
has identifier: FP9083
notation: FP9083
had primary source: FP9083
scope note: This metric is intended to capture the total value held in customers’ deposit accounts with the organization as of the end of the reporting period.
defined by: giin

Fixed Assets
type: Concept
type: Code
has name: Fixed Assets
has description: Value, as of the end of the reporting period, of the organization's long-term tangible assets that the organization does not expect to convert into cash in the current or upcoming fiscal year.
definition: Value, as of the end of the reporting period, of the organization's long-term tangible assets that the organization does not expect to convert into cash in the current or upcoming fiscal year.
has identifier: FP9148
notation: FP9148
had primary source: FP9148
scope note: This metric is intended to capture the organization’s fixed assets (such as property, plant, and equipment). These are tangible items that are: (a) held for use in the production or supply of goods or services, for rental to others, or for administrative property, plant, and equipment purposes; or (b) expected to be used during more than one period. This metric should not include Investment Properties. Fixed assets are considered part of non-current assets, which are a component of Total Assets (FP5293).
defined by: giin

Depreciation and Amortization Expenses
type: Concept
type: Code
has name: Depreciation and Amortization Expenses
has description: Value of expenses recorded by the organization during the reporting period for depreciation and amortization.
definition: Value of expenses recorded by the organization during the reporting period for depreciation and amortization.
has identifier: FP9462
notation: FP9462
had primary source: FP9462
scope note: This metric is intended to capture the costs the organization incurred during the reporting period for depreciation and amortization of assets on a defined schedule over time.
defined by: giin

Capital Expenditure (CapEx)
type: Concept
type: Code
has name: Capital Expenditure (CapEx)
has description: Value of funds used by a company to acquire, upgrade, and maintain physical assets such as property, plants, buildings, technology, or equipment during the reporting period.
definition: Value of funds used by a company to acquire, upgrade, and maintain physical assets such as property, plants, buildings, technology, or equipment during the reporting period.
has identifier: FP9573
notation: FP9573
had primary source: FP9573
scope note: This metric is intended to capture the expenses that an organization incurs which are counted as capital. It may be calculated using fixed assets and depreciation and amortization.
defined by: giin

Selling, General, and Administration Expenses
type: Concept
type: Code
has name: Selling, General, and Administration Expenses
has description: This metric is intended to capture the costs the organization incurred during the reporting period for depreciation and amortization of assets on a defined schedule over time.
definition: This metric is intended to capture the costs the organization incurred during the reporting period for depreciation and amortization of assets on a defined schedule over time.
has identifier: FP9649
notation: FP9649
had primary source: FP9649
scope note: This metric is intended to capture all sales, general, and administrative expenses incurred by the organization during the reporting period, whether or not any of these may be directly associated with sales of a particular product or service.
defined by: giin

Cash Flow: Investing Activities
type: Concept
type: Code
has name: Cash Flow: Investing Activities
has description: Value of the organization's cash flow during the reporting period related to investing activities by the organization.
definition: Value of the organization's cash flow during the reporting period related to investing activities by the organization.
has identifier: FP9703
notation: FP9703
had primary source: FP9703
scope note: This metric is intended to capture the organization’s cash flow from investing activities during the reporting period, which are the acquisition and disposal of long-term assets and other investments that are not considered to be cash equivalents.
defined by: giin

Loan Write-Offs
type: Concept
type: Code
has name: Loan Write-Offs
has description: Value of loans written off by the organization during the reporting period.
definition: Value of loans written off by the organization during the reporting period.
has identifier: FP9717
notation: FP9717
had primary source: FP9717
scope note: This metric is intended to capture the accounting transaction of removing a loan from the balance sheet while decreasing Impairment Loss Allowance (FP2392), also on the balance sheet.
defined by: giin

Value of Loans Fully Repaid on Time
type: Concept
type: Code
has name: Value of Loans Fully Repaid on Time
has description: Value of the organization’s loans due for complete payback during the reporting period (but disbursed at any time) that were repaid no later than their due dates.
definition: Value of the organization’s loans due for complete payback during the reporting period (but disbursed at any time) that were repaid no later than their due dates.
has identifier: FP9954
notation: FP9954
had primary source: FP9954
scope note: This metric is intended to capture the value of loans due and repaid on time during the reporting period. Organizations should report the entire repaid principal balance but not accrued interest. This metric can include the value of loans distributed in previous reporting periods with a repayment due date in the current reporting period. Organizations are also encouraged to report the value of loans fully repaid on time during the reporting period as a percentage of the value of loans due for repayment during the reporting period.
defined by: giin

Racial Equity Negative Screen
type: Concept
type: Code
has name: Racial Equity Negative Screen
has description: Indicates whether the investing organization applied a racial equity–focused negative screen to all investments during the reporting period, including at least an analysis of potential harmful effects on communities historically marginalized due to race and/or ethnicity.
definition: Indicates whether the investing organization applied a racial equity–focused negative screen to all investments during the reporting period, including at least an analysis of potential harmful effects on communities historically marginalized due to race and/or ethnicity.
has identifier: ID0120
notation: ID0120
had primary source: ID0120
note: Organizations should footnote all assumptions used, including locally relevant definitions of historically marginalized groups due to race and/or ethnicity and which criteria led to exclusion from the portfolio.
scope note: This metric is intended to capture whether the investing organization screens potential investees for practices, policies, or outcomes that are harmful to groups historically marginalized due to race and/or ethnicity. For further guidance and examples, see the IRIS+ Racial Equity theme as well as Adasina Social Capital (https://adasina.com/investments/) and FreeCap Financial (https://www.freecapfinancial.com/). This metric aligns with the Corporate Racial Equity Alliance’s (https://corporateracialequityalliance.org/) Investor Blueprint for Racial Equity and CEO Blueprint for Racial Equity (https://corporateracialequityalliance.org/2021-blueprint).
defined by: giin

Racial Equity Audit
type: Concept
type: Code
has name: Racial Equity Audit
has description: Indicates whether the organization completed a racial equity audit during the reporting period.
definition: Indicates whether the organization completed a racial equity audit during the reporting period.
has identifier: ID1046
notation: ID1046
note: Organizations should footnote all assumptions used, including locally relevant definitions of historically marginalized groups due to race and/or ethnicity, what was included in the audit, and whether it was conducted by an independent third party.
scope note: This metric is intended to capture whether the organization completed a racial equity audit specifically during the reporting period. If the organization completed a racial equity audit before the reporting period began, organizations should select “No.” Organizations, and especially investing organizations, should complete racial equity audits regularly to guide both internal practices and external activities. The outcome of the audit should inform the organization's racial equity strategy by leading to an action plan, and the organization should promptly mitigate any inequities identified. For further guidance on racial equity audits, including tools, see the Resources tab in the IRIS+ Racial Equity theme. Organizations may also consult the Resources section of this metric for guidance on how racial equity audits can be most effective and what tools exist to support equity audits. Organizations should footnote details on how and by whom the audit was conducted. For further guidance and examples of racial equity audits, see Majority Action (https://www.racialjustice.majorityaction.us/racial-equity-auditing) and SOC Investment Group (https://www.socinvestmentgroup.com/racial-equity-audit). This metric aligns with the Corporate Racial Equity Alliance’s (https://corporateracialequityalliance.org/) Investor Blueprint for Racial Equity and CEO Blueprint for Racial Equity (https://corporateracialequityalliance.org/2021-blueprint).
defined by: giin

Bias-Reducing Investment Practices
type: Concept
type: Code
has name: Bias-Reducing Investment Practices
has description: Describes practices the investing organization implemented during the reporting period to reduce biases in investment criteria, policies, and processes that have disproportionately negative effects on entrepreneurs who are from groups historically marginalized due to race and/or ethnicity. See usage guidance for specific practices to address.
definition: Describes practices the investing organization implemented during the reporting period to reduce biases in investment criteria, policies, and processes that have disproportionately negative effects on entrepreneurs who are from groups historically marginalized due to race and/or ethnicity. See usage guidance for specific practices to address.
has identifier: ID8539
notation: ID8539
had primary source: ID8539
note: Organizations should footnote all assumptions used, including progress on shifting practices and what further practices the organization is considering changing.
scope note: This metric is intended to describe bias-reducing investing practices employed by investors during the reporting period. Specific practices for asset owners to describe, when applicable, include the following, drawn from the Due Diligence 2.0 Commitment (https://www.duediligencecommitment.com/): - Consideration of track record alternatives for fund managers, investment strategies, and investment products - Expansion of relevant experience in evaluating stability of partnership with individual investment managers - Evaluation of alternative proxies for financial stability of a manager, including (a) the manager’s history of operating effectively with lower than industry-standard budgets, (b) growth momentum in assets under management (AUM), (c) AUM growth in previous position(s) at prior firm(s), and (d) what happens to the underlying investments in the event of firm insolvency - Minimization of requests for time by reducing asks for meeting time with historically marginalized managers and condensing, standardizing, and supporting managers with RFIs and RFPs - Contextualization of fees - Inclusion of historically unrecognized risks in analysis - Investment as an anchor/seed investor or as part of a first close without lower fee requirement - Provision of transparency on minimum thresholds and deal-breakers when circulating RFPs or RFIs - Provision of clear, detailed, and timely feedback to historically marginalized managers who are rejected Specific practices for direct investors to describe, when applicable, include the following, drawn in part from Path to 15|55’s “How Usable Capital Will Unleash Black Business Growth” (https://www.pathto1555.org/_files/ugd/baac54_b384b1919ac848f4b25f37bd5bf69036.pdf): - Consideration of alternatives to credit scores in assessing credit worthiness - Consideration of alternatives to collateral and personal guarantees in underwriting - Provision of interest rates based on ability to pay (rather than risk-based rates) - Provision of t…
defined by: giin

Racial Equity Strategy
type: Concept
type: Code
has name: Racial Equity Strategy
has description: Indicates whether the organization implements a strategy to set targets, drive progress toward, and report on racial equity goals.
definition: Indicates whether the organization implements a strategy to set targets, drive progress toward, and report on racial equity goals.
has identifier: ID9449
notation: ID9449
had primary source: ID9449
note: Organizations should footnote all assumptions used, including locally relevant definitions of historically marginalized groups due to race and/or ethnicity.
scope note: This metric is intended to capture whether the organization has a formal, stated strategy for setting goals (and associated time-bound targets), progressing toward, and reporting on racial equity. Beyond indicating whether such a strategy exists, organizations are strongly encouraged to footnote details on their strategy and staff members responsible for implementation. Organizations should carefully consider which staff members and stakeholders are involved in crafting their strategy and how frequently they will update that strategy. For further guidance on what to include in a racial equity strategy, see the Resources tab. Examples of considerations include: setting and publicly disclosing targets around capital deployed to companies or communities led by individuals from groups historically marginalized due to race and/or ethnicity; adoption of new hiring, retention, and advancement practices to combat implicit racial bias and address structural barriers; and grievance mechanisms. For further details on equitable employment that can be applied to investor and investee organizations, see the IRIS+ Quality Jobs theme (iris.thegiin.org). The organization's racial equity strategy should be informed by the outcome of periodic racial equity audits. This metric aligns with the Corporate Racial Equity Alliance’s (https://corporateracialequityalliance.org/) Investor Blueprint for Racial Equity and CEO Blueprint for Racial Equity (https://corporateracialequityalliance.org/2021-blueprint).
defined by: giin

Assets Under Management: Total
type: Concept
type: Code
has name: Assets Under Management: Total
has description: Value of the investing organization's total assets under management as of the end of the reporting period.
definition: Value of the investing organization's total assets under management as of the end of the reporting period.
has identifier: ID9608
notation: ID9608
had primary source: ID9608
note: Organizations should footnote all assumptions used.
scope note: This metric is intended to capture the value (in currency) of an investor's assets under management.
defined by: giin

Value of Capacity Building and Advisory Services Provided
type: Concept
type: Code
has name: Value of Capacity Building and Advisory Services Provided
has description: Value of the investing organization's support for capacity-building efforts at investee companies as of the end of the reporting period.
definition: Value of the investing organization's support for capacity-building efforts at investee companies as of the end of the reporting period.
has identifier: II0324
notation: II0324
had primary source: II0324
note: Organizations should footnote all assumptions used.
scope note: This metric is intended to capture the value of the investing organization's support for capacity-building efforts at companies in their portfolio as of the end of the reporting period. Organizations should include only that support they paid for directly and should exclude any support funded by third parties. Per the United Nations (https://www.un.org/en/academic-impact/capacity-building), capacity building is "the process of developing and strengthening the skills, instincts, abilities, processes and resources that organizations and communities need to survive, adapt, and thrive in a fast-changing world." For entrepreneurs and companies, capacity building can include trainings in fundraising techniques, fiscal management, or other business skills; support in recruiting and hiring staff or volunteers; networking support; consulting services regarding process implementation; mentoring; and purchasing IT and other equipment or resources to support business growth. For an example of how investors can provide capacity-building support to entrepreneurs, see "Unleashing the Potential of Entrepreneurs of Color in Massachusetts: A Blueprint for Economic Growth and Equitable Recovery" (https://massinc.org/research/entrepreneurs-of-color/). Used along with Target Stakeholder Demographic (PD5752) to specify historically marginalized groups due to race and/or ethnicity, this metric aligns with the Corporate Racial Equity Alliance’s (https://corporateracialequityalliance.org/) Investor Blueprint for Racial Equity and its corporate-focused CEO Blueprint for Racial Equity (https://corporateracialequityalliance.org/2021-blueprint).
defined by: giin

Fund Managers: Considered for Investment
type: Concept
type: Code
has name: Fund Managers: Considered for Investment
has description: Number of unique individuals affiliated with the organization who were candidates to manage client assets via funds and/or separate accounts during the reporting period.
definition: Number of unique individuals affiliated with the organization who were candidates to manage client assets via funds and/or separate accounts during the reporting period.
has identifier: II2107
notation: II2107
had primary source: II2107
note: Organizations should footnote all assumptions used.
scope note: This metric is intended to capture the number of financial professionals (individuals) affiliated with the organization who were candidates to manage money and securities—that is, those individuals in the pipeline—on behalf of one or more clients with the goal of growing the asset value. Organizations should count all individuals in the pipeline at any point during the reporting period, regardless of whether or not they made investments. Both indirectly and directly investing organizations may use this metric. For indirectly investing organizations (sometimes termed asset owners), this metric refers to the number of asset managers/fund managers that externally manage their assets. For directly investing organizations, this metric refers to the number of asset managers working within the organization to manage funds. Used along with Target Stakeholder Demographic (PD5752) to specify historically marginalized groups due to race and/or ethnicity, this metric aligns with the Corporate Racial Equity Alliance’s (https://corporateracialequityalliance.org/) Investor Blueprint for Racial Equity and its corporate-focused CEO Blueprint for Racial Equity (https://corporateracialequityalliance.org/2021-blueprint).
defined by: giin

Assets Under Management: Managed by Fund Managers from Historically Marginalized Groups
type: Concept
type: Code
has name: Assets Under Management: Managed by Fund Managers from Historically Marginalized Groups
has description: Value of the investing organization's assets under management (AUM) invested with fund managers from groups historically marginalized due to race and/or ethnicity as of the end of the reporting period.
definition: Value of the investing organization's assets under management (AUM) invested with fund managers from groups historically marginalized due to race and/or ethnicity as of the end of the reporting period.
has identifier: II4910
notation: II4910
had primary source: II4910
note: Organizations should footnote all assumptions used, including locally relevant definitions of historically marginalized groups due to race and/or ethnicity.
scope note: This metric is intended to capture the amount of the organization’s capital that is managed by fund managers from groups historically marginalized due to race and/or ethnicity. Organizations are strongly encouraged to set quantitative, time-bound targets on this metric as a percentage of Assets Under Management: Total (ID9608) and to disclose these publicly. This metric applies both to fund managers within the organization (for direct investors) and to fund managers hired by the organization to manage funds (for indirect investors). Organizations must footnote contextual definitions of marginalized groups. For example, in the United States, organizations might focus on Black, Indigenous, and People of Color (BIPOC). In South Africa, organizations might focus on Black African, Coloured, and Indian or Asian individuals. In all contexts, organizations must consider local history and context in their definition. These data can often be collected from the human resources department, though for accuracy organizations should ensure that data on racial and ethnic background are self-reported. Used along with Target Stakeholder Demographic (PD5752) to specify historically marginalized groups due to race and/or ethnicity, this metric aligns with the Corporate Racial Equity Alliance’s (https://corporateracialequityalliance.org/) Investor Blueprint for Racial Equity and its corporate-focused CEO Blueprint for Racial Equity (https://corporateracialequityalliance.org/2021-blueprint).
defined by: giin

Companies Considered for Investment: Total
type: Concept
type: Code
has name: Companies Considered for Investment: Total
has description: Number of companies the organization considered for investment—that is, in the pipeline—during the reporting period.
definition: Number of companies the organization considered for investment—that is, in the pipeline—during the reporting period.
has identifier: II5202
notation: II5202
had primary source: II5202
note: Organizations should footnote all assumptions used.
scope note: This metric is intended to capture the number of companies in the organization’s investing pipeline during the reporting period. Organizations should count all companies in the pipeline at any point during the reporting period, regardless of whether or not investment or the investment process proceeded. This metric aligns with the Corporate Racial Equity Alliance’s (https://corporateracialequityalliance.org/) Investor Blueprint for Racial Equity.
defined by: giin

Fund Managers: Total
type: Concept
type: Code
has name: Fund Managers: Total
has description: Number of unique individuals affiliated with the organization who were managing client assets via funds and/or separate accounts as of the end of the reporting period.
definition: Number of unique individuals affiliated with the organization who were managing client assets via funds and/or separate accounts as of the end of the reporting period.
has identifier: II5889
notation: II5889
had primary source: II5889
note: Organizations should footnote all assumptions used.
scope note: This metric is intended to capture the number of financial professionals (individuals) affiliated with the organization who manage money and securities on behalf of one or more clients with the goal of growing the asset value. Both indirectly and directly investing organizations may use this metric. For indirectly investing organizations (sometimes termed asset owners), this metric refers to the number of asset managers/fund managers that externally manage their assets. For directly investing organizations, this metric refers to the number of asset managers working within the organization to manage funds. Used along with Target Stakeholder Demographic (PD5752) to specify historically marginalized groups due to race and/or ethnicity, this metric aligns with the Corporate Racial Equity Alliance’s (https://corporateracialequityalliance.org/) Investor Blueprint for Racial Equity and its corporate-focused CEO Blueprint for Racial Equity (https://corporateracialequityalliance.org/2021-blueprint).
defined by: giin

Value of Investments in Communities Historically Marginalized Due to Race and/or Ethnicity
type: Concept
type: Code
has name: Value of Investments in Communities Historically Marginalized Due to Race and/or Ethnicity
has description: Value of the investing organization's assets under management deployed to communities that are predominantly populated by groups historically marginalized due to race and/or ethnicity as of the end of the reporting period.
definition: Value of the investing organization's assets under management deployed to communities that are predominantly populated by groups historically marginalized due to race and/or ethnicity as of the end of the reporting period.
has identifier: II6610
notation: II6610
had primary source: II6610
note: Organizations should footnote all assumptions used, including locally relevant definitions of historically marginalized groups due to race and/or ethnicity.
scope note: This metric is intended to capture the amount of capital managed by the organization that is invested into communities in which a majority (51%) of individuals are from groups historically marginalized due to race and/or ethnicity as defined locally. Organizations must footnote context for this metric. For example, in the United States, organizations are encouraged to use data at the zip code level to determine which areas are home to majority Black, Indigenous, and Person of Color (BIPOC) populations. In South Africa, organizations could define "community" as a district or municipality and might focus on communities that are home to many Black African, Coloured, and Indian or Asian individuals. Used along with Target Stakeholder Demographic (PD5752) to specify historically marginalized groups due to race and/or ethnicity, this metric aligns with the Corporate Racial Equity Alliance’s (https://corporateracialequityalliance.org/) Investor Blueprint for Racial Equity and its corporate-focused CEO Blueprint for Racial Equity (https://corporateracialequityalliance.org/2021-blueprint).
defined by: giin

Companies Considered for Investment: Led by Founders from Historically Marginalized Groups due to Race and/or Ethnicity
type: Concept
type: Code
has name: Companies Considered for Investment: Led by Founders from Historically Marginalized Groups due to Race and/or Ethnicity
has description: Number of companies the organization considered for investment—that is, in the pipeline—during the reporting period that were led by founders from groups historically marginalized due to race and/or ethnicity.
definition: Number of companies the organization considered for investment—that is, in the pipeline—during the reporting period that were led by founders from groups historically marginalized due to race and/or ethnicity.
has identifier: II8439
notation: II8439
had primary source: II8439
note: Organizations should footnote all assumptions used, including locally relevant definitions of historically marginalized groups due to race and/or ethnicity.
scope note: This metric is intended to capture the number of companies in the organization’s investing pipeline during the reporting period that are led by individuals from groups historically marginalized due to race and/or ethnicity. To qualify, an organization's leadership must be at least 50% from historically marginalized groups due to race and/or ethnicity, defined by the organization within the local context (see following note). Organizations should count all companies in the pipeline at any point in the reporting period, regardless of whether or not investment or the investment process proceeded. Organizations focusing this metric on groups historically marginalized due to race and/or ethnicity must define that group according to context. For example, in the United States, organizations might focus on Black, Indigenous, and People of Color (BIPOC). In South Africa, organizations might focus on Black African, Coloured, and Indian or Asian Individuals. In all contexts, when defining these groups, organizations must consider local history and context. This metric aligns with the Corporate Racial Equity Alliance’s (https://corporateracialequityalliance.org/) Investor Blueprint for Racial Equity.
defined by: giin

Value of Investments in Company: Outstanding
type: Concept
type: Code
has name: Value of Investments in Company: Outstanding
has description: Value of the investing organization's outstanding investment in a company as of the end of the reporting period. See usage guidance for details.
definition: Value of the investing organization's outstanding investment in a company as of the end of the reporting period. See usage guidance for details.
has identifier: II8480
notation: II8480
had primary source: II8480
note: Organizations should footnote all assumptions used.
scope note: This metric is intended to capture the present value of an investment the investing organization made as of the end of the reporting period. For a debt investment, this value is the difference between the original loan amount and the repaid principal. For an equity investment, this is an estimated valuation of the investor's stake in the investee as of the end of the reporting period.
defined by: giin

Value of Investments in Company: Total
type: Concept
type: Code
has name: Value of Investments in Company: Total
has description: Value of the investing organization's investment in a company as of the beginning of the investment.
definition: Value of the investing organization's investment in a company as of the beginning of the investment.
has identifier: II9005
notation: II9005
had primary source: II9005
note: Organizations should footnote all assumptions used.
scope note: This metric is intended to capture the value at disbursement of an investment the investing organization made.
defined by: giin

Racial Equity Transparency Practice
type: Concept
type: Code
has name: Racial Equity Transparency Practice
has description: Indicates whether the organization has a formalized and ongoing practice of sharing publicly its positions, practices, progress, and advocacy related to racial equity as a mechanism to build trust and ensure adherence.
definition: Indicates whether the organization has a formalized and ongoing practice of sharing publicly its positions, practices, progress, and advocacy related to racial equity as a mechanism to build trust and ensure adherence.
has identifier: OD0482
notation: OD0482
had primary source: OD0482
note: Organizations should footnote all assumptions used, including locally relevant definitions of equity, equitable practices, and historically marginalized groups due to race and/or ethnicity.
scope note: This metric is intended to capture whether the organization works to share its positions, practices, and progress on racial equity in its external communications, including advocating for others to join in doing so. Such organizations are showing more authentic transparency and supporting broader change. Communications captured under this metric may include a public statement in support of racial equity but should additionally share progress made toward racial equity goals, transparently disclose challenges experienced, and call on others in the sector (e.g., the investment community) to support racial equity (e.g., in investing). In other words, a statement alone is insufficient for a racial equity lens but is an important precursor to further work. For further guidance on racial equity statements, see the Resources section within the IRIS+ Racial Equity theme. This metric aligns with the Corporate Racial Equity Alliance’s (https://corporateracialequityalliance.org/) Investor Blueprint for Racial Equity and CEO Blueprint for Racial Equity (https://corporateracialequityalliance.org/2021-blueprint).
defined by: giin

Jobs Type
type: Concept
type: Code
has name: Jobs Type
has description: Describes the type of jobs supported, created, maintained, or lost during the reporting period. Choose all that apply: Permanence: - Permanent - Temporary (seasonal or repeated) - Temporary (one-time) - Other Hiring: - Jobs hired through organization itself - Jobs hired/supported through a third-party and directly related to the organization’s operations and maintenance - Jobs hired/supported through a third-party but not directly related to the organization’s operations and maintenance - Other Full-Time/Part-Time: - Full-time - Part-time - Other
definition: Describes the type of jobs supported, created, maintained, or lost during the reporting period. Choose all that apply: Permanence: - Permanent - Temporary (seasonal or repeated) - Temporary (one-time) - Other Hiring: - Jobs hired through organization itself - Jobs hired/supported through a third-party and directly related to the organization’s operations and maintenance - Jobs hired/supported through a third-party but not directly related to the organization’s operations and maintenance - Other Full-Time/Part-Time: - Full-time - Part-time - Other
has identifier: OD0660
had primary source: OD0660
note: Organizations should footnote all assumptions used.
scope note: This metric is intended to capture how to distinguish and disaggregate jobs directly or indirectly supported by the investment.
defined by: giin

Location of Organization's Operating Facilities
type: Concept
type: Code
has name: Location of Organization's Operating Facilities
has description: Address of the organization's operating facilities.
definition: Address of the organization's operating facilities.
has identifier: OD1777
notation: OD1777
had primary source: OD1777
scope note: This metric is intended to capture the organization’s operational location. Operating facilities can include manufacturing, distribution, or other operating functions. Organizations are encouraged to include the full address of the facilities, including Street Name and Number, District/City, Postal Code, and Country.
defined by: giin

Racial Equity Advocacy Strategy
type: Concept
type: Code
has name: Racial Equity Advocacy Strategy
has description: Indicates whether the organization has an advocacy strategy in place to support racial equity and justice efforts at local and national levels as of the end of the reporting period.
definition: Indicates whether the organization has an advocacy strategy in place to support racial equity and justice efforts at local and national levels as of the end of the reporting period.
has identifier: OD2311
notation: OD2311
had primary source: OD2311
note: Organizations should footnote all assumptions used, including locally relevant definitions of equity, equitable policies, and historically marginalized groups due to race and/or ethnicity.
scope note: This metric is intended to capture whether the organization works to share its positions, practices, and progress on racial equity in its external communications, including advocating for others to join in doing so. Such organizations are showing more authentic transparency and supporting broader change. Communications captured under this metric may include a public statement in support of racial equity but should additionally share progress made toward racial equity goals, transparently disclose challenges experienced, and call on others in the sector (e.g., the investment community) to support racial equity (e.g., in investing). In other words, a statement alone is insufficient for a racial equity lens but is an important precursor to further work. For further guidance on racial equity statements, see the Resources section within the IRIS+ Racial Equity theme. This metric aligns with the Corporate Racial Equity Alliance’s (https://corporateracialequityalliance.org/) Investor Blueprint for Racial Equity and CEO Blueprint for Racial Equity (https://corporateracialequityalliance.org/2021-blueprint).
defined by: giin

Mission Statement
type: Concept
type: Code
has name: Mission Statement
has description: Describes the mission statement of the organization.
definition: Describes the mission statement of the organization.
has identifier: OD2735
notation: OD2735
had primary source: OD2735
scope note: This metric is intended to capture the organization’s mission statement, which expresses its reason for existence or core purpose. Mission statements establish the long-term direction and goals that guide an organization's daily operations, providing a foundation for an organization's activities, communications, organizational structure, and culture. Internally, mission statements are often used to inspire employees, board members, and volunteers; guide leaders' decision-making; support the organization's theory of change (see Theory of Change [OD6350]); and help set goals (see Social and Environmental Targets [OD4091]). Externally, mission statements are often used to generate external support and communicate goals and aspirations to stakeholders. Organizations can refer to the SPI4 (http://cerise-spi4.squarespace.com/), specifically Essential Practice 1a1, for additional indicators related to well-crafted mission statements. SPI4 is a social audit tool, developed for financial service providers, which can apply to any organization with both social and financial objectives.
defined by: giin

Legal Structure
type: Concept
type: Code
has name: Legal Structure
has description: Describes the legal structure of the organization. Select one: - Benefit Corporation - Co-op - Corporation - Limited Liability Company - Nonprofit/Non-Governmental Organization - Partnership - Sole-proprietorship - Other
definition: Describes the legal structure of the organization. Select one: - Benefit Corporation - Co-op - Corporation - Limited Liability Company - Nonprofit/Non-Governmental Organization - Partnership - Sole-proprietorship - Other
has identifier: OD2999
notation: OD2999
had primary source: OD2999
note: Organizations should footnote details in cases with related organizations, hybrids, or spinoffs reporting as a single organization.
scope note: This metric is intended to capture the organization’s legal structure. Organizations can refer to the glossary for additional information on these various legal structures.
defined by: giin

Board of Directors Remuneration
type: Concept
type: Code
has name: Board of Directors Remuneration
has description: Describes the compensation practices for members of the board of directors or other governing body of the reporting organization.
definition: Describes the compensation practices for members of the board of directors or other governing body of the reporting organization.
has identifier: OD3292
notation: OD3292
had primary source: OD3292
note: Organizations should footnote details on the remuneration provided. See usage guidance for further information.
scope note: This metric is intended to capture the compensation paid to members of the organization’s board of directors, a group of individuals legally responsible to govern a corporation and responsible to the shareholders and other relevant stakeholders. A governing body with a different name (e.g., "advisory body") may be considered a Board of Directors provided it has a fiduciary and/or social responsibility to shareholders and/or other relevant stakeholders. Organizations should only report remuneration provided to members of the Board of Directors who are not paid employees of the reporting organization. Examples of details to footnote on the type of remuneration provided include: yearly or monthly salaries, additional compensation for meetings attended, stock options, insurance, and other benefits.
defined by: giin

Year Founded
type: Concept
type: Code
has name: Year Founded
has description: Year the organization was founded.
definition: Year the organization was founded.
has identifier: OD3520
notation: OD3520
had primary source: OD3520
note: Organizations should footnote all assumptions used.
scope note: This metric is intended to capture the year the organization began operations.
defined by: giin

IRIS ID
type: Concept
type: Code
has name: IRIS ID
has description: IRIS ID of the organization reporting data.
definition: IRIS ID of the organization reporting data.
has identifier: OD3725
notation: OD3725
had primary source: OD3725
scope note: This metric is intended to capture the organization’s IRIS ID. The metric only applies to organizations submitting data to the IRIS data project as part of a voluntary data contribution process.
defined by: giin

Social and Environmental Targets
type: Concept
type: Code
has name: Social and Environmental Targets
has description: Describes the quantifiable social and environmental targets set by the organization.
definition: Describes the quantifiable social and environmental targets set by the organization.
has identifier: OD4091
notation: OD4091
had primary source: OD4091
note: Organizations should footnote details on specific targets, timeframes for accomplishing these targets, and how results will be measured for these targets. See usage guidance for further information.
scope note: This metric is intended to capture the organization’s social and/or environmental targets. Typically consistent with the organization's mission, these targets should be specific, measurable, attainable, relevant, and time bound. Other IRIS metrics can be used to measure progress towards these goals. This metric may be used in conjunction with Social Impact Objectives (OD6247) and/or Environmental Impact Objectives (OD4108). For example, an organization can have a Social Impact Objective of providing access to clean water and sanitation, with specific targets regarding the total amount of clean water provided and the number of individuals to which it is provided. Organizations are also encouraged to report this metric in conjunction with Social and Environmental Performance Reporting (OI4732) and Social and Environmental Performance Risk Assessment (OI9106).
defined by: giin

Environmental Impact Objectives
type: Concept
type: Code
has name: Environmental Impact Objectives
has identifier: OD4108
notation: OD4108
had primary source: OD4108
note: Organizations should footnote how their operations and/or products/services pursue the selected objectives. See usage guidance for further information.
scope note: This metric is intended to capture an organization’s environmental impact objectives in the standardized format of the IRIS+ thematic taxonomy. It does not capture how well organizations achieve or manage these impact objectives. Organizations are encouraged to report this metric in conjunction with Theory of Change (OD6350) and Social and Environmental Targets (OD4091) in order to provide supporting details on their activities, inputs, outputs, outcomes, and impacts in pursuit of these objectives. Organizations pursuing social impact objectives as well are encouraged to report Social Impact Objectives (OD6247).
has description: Describes the environmental impact objectives pursued by the organization. Select all that apply: Agriculture—Food Security: - Increasing Access to Agricultural Training and Information - Increasing Access to and Use of Products and Services for Agricultural Risk Mitigation - Increasing Access to Better, Stable Pricing of Agricultural Products - Increasing Farm Profitability - Increasing Financial Health of Farmers - Increasing Food Security through Smallholder Farms - Mitigating Climate Change through Sustainable Agriculture Agriculture—Smallholder Agriculture: - Improving Agricultural Water Use Practices - Improving Rural Economies through Financial Inclusion - Increasing Access to Agricultural Training and Information - Increasing Access to and Use of Products and Services for Agricultural Risk Mitigation - Increasing Access to and Use of Quality Agricultural Inputs - Increasing Access to Better, Stable Pricing of Agricultural Products - Increasing Farm Profitability - Increasing Financial Health of Farmers - Increasing Food Security through Smallholder Farms - Increasing the Sustainability of Non-Wood Forest Products - Mitigating Climate Change through Sustainable Agriculture Agriculture—Sustainable Agriculture: - Conserving River Flows for Nature and People - Improving Agricultural Water Use Practices - Mitigating Climate Change through Sustainable Agriculture Agriculture—Other (describe) Air—Clean Air: - Mitigating Carbon Emissions from Forestry and Land Use - Mitigating Climate Change through Carbon Capture and Sequestration - Mitigating Climate Change through Clean Electricity and Heat Production - Mitigating Climate Change through Clean Mobility - Mitigating Climate Change through Sustainable Manufacturing Air—Other (describe) Biodiversity and Ecosystems—Biodiversity & Ecosystem Conservation: - Conserving River Flows for Nature and People - Improving Agricultural Water Use Practices - Improving Biodiversity by Reducing Impacts from Salt- and Freshwater Aqua…
definition: Describes the environmental impact objectives pursued by the organization. Select all that apply: Agriculture—Food Security: - Increasing Access to Agricultural Training and Information - Increasing Access to and Use of Products and Services for Agricultural Risk Mitigation - Increasing Access to Better, Stable Pricing of Agricultural Products - Increasing Farm Profitability - Increasing Financial Health of Farmers - Increasing Food Security through Smallholder Farms - Mitigating Climate Change through Sustainable Agriculture Agriculture—Smallholder Agriculture: - Improving Agricultural Water Use Practices - Improving Rural Economies through Financial Inclusion - Increasing Access to Agricultural Training and Information - Increasing Access to and Use of Products and Services for Agricultural Risk Mitigation - Increasing Access to and Use of Quality Agricultural Inputs - Increasing Access to Better, Stable Pricing of Agricultural Products - Increasing Farm Profitability - Increasing Financial Health of Farmers - Increasing Food Security through Smallholder Farms - Increasing the Sustainability of Non-Wood Forest Products - Mitigating Climate Change through Sustainable Agriculture Agriculture—Sustainable Agriculture: - Conserving River Flows for Nature and People - Improving Agricultural Water Use Practices - Mitigating Climate Change through Sustainable Agriculture Agriculture—Other (describe) Air—Clean Air: - Mitigating Carbon Emissions from Forestry and Land Use - Mitigating Climate Change through Carbon Capture and Sequestration - Mitigating Climate Change through Clean Electricity and Heat Production - Mitigating Climate Change through Clean Mobility - Mitigating Climate Change through Sustainable Manufacturing Air—Other (describe) Biodiversity and Ecosystems—Biodiversity & Ecosystem Conservation: - Conserving River Flows for Nature and People - Improving Agricultural Water Use Practices - Improving Biodiversity by Reducing Impacts from Salt- and Freshwater Aqua…
defined by: giin

Women's Career Advancement Initiative
type: Concept
type: Code
has name: Women's Career Advancement Initiative
has description: Indicates whether the organization has an initiative in place to advance women in their workforce.
definition: Indicates whether the organization has an initiative in place to advance women in their workforce.
has identifier: OD4232
notation: OD4232
had primary source: OD4232
note: Organizations should footnote all assumptions used.
scope note: This metric is intended to capture whether or not the organization specifically works to advance women’s careers. To report against 2X Challenge requirements, organizations must report this metric in combination with one or more of the following metrics that detail which initiatives are in place: Diverse Representation Policy (OI9485), Flexible Work Arrangements (OI7983), Sexual Harassment Policy (OI9088), Employment Benefits (OI2742), Fair Compensation Policy (OI3819), Fair Career Advancement Policy (OI4884), or Anti-Discrimination Policy (OI9331). To qualify under the 2X criteria, additional metric(s) must have specific benefits for women and must exceed compliance with local regulations and standards in the local context.
defined by: giin

Name of Organization
type: Concept
type: Code
has name: Name of Organization
has description: Name of the organization.
definition: Name of the organization.
has identifier: OD5828
notation: OD5828
had primary source: OD5828
note: Organizations should footnote all assumptions used.
scope note: This metric is intended to capture a widely recognized name for the organization, such as its legal name.
defined by: giin

Reporting Currency
type: Concept
type: Code
has name: Reporting Currency
has description: The national currency used to report currency figures in this IRIS report. Indicate based on the International Organization for Standardization (ISO) Currency List. Select from the options in the Reference List tab.
definition: The national currency used to report currency figures in this IRIS report. Indicate based on the International Organization for Standardization (ISO) Currency List. Select from the options in the Reference List tab.
has identifier: OD5990
notation: OD5990
had primary source: OD5990
note: Organizations should footnote the currency or currencies for each product/service for which data is being reported. See usage guidance for further information.
scope note: This metric is intended to capture the currency in which the organization makes a report. For example, if reporting Sales Revenue (PI1775) for two crops in different countries, one measured in West African CFA Franc and the other measured in USD, the organization should report this metric separately for each crop.
defined by: giin

Social Impact Objectives
type: Concept
type: Code
has name: Social Impact Objectives
has identifier: OD6247
notation: OD6247
had primary source: OD6247
note: Organizations should footnote how their operations and/or products/services pursue the selected objectives. See usage guidance for further information.
scope note: This metric is intended to capture an organization’s social impact objectives in the standardized format of the IRIS+ thematic taxonomy. It does not capture how well organizations achieve or manage against these impact objectives. Organizations are encouraged to report this metric in conjunction with Theory of Change (OD6350) and Social and Environmental Targets (OD4091) in order to provide supporting details on their activities, inputs, outputs, outcomes, and impacts in pursuit of these objectives. Organizations pursuing environmental impact objectives as well are encouraged to report Environmental Impact Objectives (OD4108).
has description: Describes the social impact objectives pursued by the organization. Select all that apply: Agriculture—Food Security: - Increasing Access to Agricultural Training and Information - Increasing Access to and Use of Products and Services for Agricultural Risk Mitigation - Increasing Access to Better, Stable Pricing of Agricultural Products - Increasing Farm Profitability - Increasing Financial Health of Farmers - Increasing Food Security through Smallholder Farms - Mitigating Climate Change through Sustainable Agriculture Agriculture—Smallholder Agriculture: - Improving Agricultural Water Use Practices - Improving Rural Economies through Financial Inclusion - Increasing Access to Agricultural Training and Information - Increasing Access to and Use of Products and Services for Agricultural Risk Mitigation - Increasing Access to and Use of Quality Agricultural Inputs - Increasing Access to Better, Stable Pricing of Agricultural Products - Increasing Farm Profitability - Increasing Financial Health of Farmers - Increasing Food Security through Smallholder Farms - Increasing the Sustainability of Non-Wood Forest Products - Mitigating Climate Change through Sustainable Agriculture Agriculture—Sustainable Agriculture: - Conserving River Flows for Nature and People - Improving Agricultural Water Use Practices - Mitigating Climate Change through Sustainable Agriculture Agriculture—Other (describe) Air—Clean Air: - Mitigating Carbon Emissions from Forestry and Land Use - Mitigating Climate Change through Carbon Capture and Sequestration - Mitigating Climate Change through Clean Electricity and Heat Production - Mitigating Climate Change through Clean Mobility - Mitigating Climate Change through Sustainable Manufacturing Air—Other (describe) Biodiversity and Ecosystems—Biodiversity & Ecosystem Conservation: - Conserving River Flows for Nature and People - Improving Agricultural Water Use Practices - Improving Biodiversity by Reducing Impacts from Salt- and Freshwater Aquaculture…
definition: Describes the social impact objectives pursued by the organization. Select all that apply: Agriculture—Food Security: - Increasing Access to Agricultural Training and Information - Increasing Access to and Use of Products and Services for Agricultural Risk Mitigation - Increasing Access to Better, Stable Pricing of Agricultural Products - Increasing Farm Profitability - Increasing Financial Health of Farmers - Increasing Food Security through Smallholder Farms - Mitigating Climate Change through Sustainable Agriculture Agriculture—Smallholder Agriculture: - Improving Agricultural Water Use Practices - Improving Rural Economies through Financial Inclusion - Increasing Access to Agricultural Training and Information - Increasing Access to and Use of Products and Services for Agricultural Risk Mitigation - Increasing Access to and Use of Quality Agricultural Inputs - Increasing Access to Better, Stable Pricing of Agricultural Products - Increasing Farm Profitability - Increasing Financial Health of Farmers - Increasing Food Security through Smallholder Farms - Increasing the Sustainability of Non-Wood Forest Products - Mitigating Climate Change through Sustainable Agriculture Agriculture—Sustainable Agriculture: - Conserving River Flows for Nature and People - Improving Agricultural Water Use Practices - Mitigating Climate Change through Sustainable Agriculture Agriculture—Other (describe) Air—Clean Air: - Mitigating Carbon Emissions from Forestry and Land Use - Mitigating Climate Change through Carbon Capture and Sequestration - Mitigating Climate Change through Clean Electricity and Heat Production - Mitigating Climate Change through Clean Mobility - Mitigating Climate Change through Sustainable Manufacturing Air—Other (describe) Biodiversity and Ecosystems—Biodiversity & Ecosystem Conservation: - Conserving River Flows for Nature and People - Improving Agricultural Water Use Practices - Improving Biodiversity by Reducing Impacts from Salt- and Freshwater Aquaculture…
defined by: giin

Operational Model
type: Concept
type: Code
has name: Operational Model
has description: Describes the operational model of the organization. Select all that apply: - Production/Manufacturing: Production and/or manufacturing of goods (e.g., farming, construction, manufacturing) - Processing/Packaging: Processing and/or packaging of goods (can include both raw materials, such as wheat, and secondary materials/goods, such as baked bread) - Distribution: Delivery of goods or services to target customers, whether by traditional transport (e.g., vehicle, rail, air) or infrastructure (e.g., electric grid operator) - Wholesale/Retail: Intermediary organization that purchases goods and sells them to new target customers - Services: Services such as education, health, communications, transportation, and social services, excluding financial services - Financial Services: Financial products and services - Other (write-in)
definition: Describes the operational model of the organization. Select all that apply: - Production/Manufacturing: Production and/or manufacturing of goods (e.g., farming, construction, manufacturing) - Processing/Packaging: Processing and/or packaging of goods (can include both raw materials, such as wheat, and secondary materials/goods, such as baked bread) - Distribution: Delivery of goods or services to target customers, whether by traditional transport (e.g., vehicle, rail, air) or infrastructure (e.g., electric grid operator) - Wholesale/Retail: Intermediary organization that purchases goods and sells them to new target customers - Services: Services such as education, health, communications, transportation, and social services, excluding financial services - Financial Services: Financial products and services - Other (write-in)
has identifier: OD6306
notation: OD6306
had primary source: OD6306
note: Organizations should footnote a detailed description of their operational model.
scope note: This metric is intended to capture the organization’s general categories of business operations.
defined by: giin

Theory of Change
type: Concept
type: Code
has name: Theory of Change
has description: Describes the theory of change of the organization.
definition: Describes the theory of change of the organization.
has identifier: OD6350
notation: OD6350
had primary source: OD6350
note: Organizations should footnote relevant details about their theory of change and whether it is publicly disseminated. See usage guidance for further information.
scope note: This metric is intended to capture the organization’s theory of change. A theory of change (also referred to as a Theory of Value Creation or Logic Model) expresses the sequence of cause-and-effect actions or occurrences by which organizational and financial resources are hypothesized to convert into the desired social and environmental results. It provides a conceptual roadmap for how an organization expects to achieve its intended impact. Often displayed in a diagram, many theories of change can be expressed as a series of if–then statements, specifying what the organization does and the expected results of each activity. A framework built around the concepts of activities, inputs, outputs, outcomes, and impacts is called a Logic Model or Impact Value Chain. Organizations can refer to the glossary for additional information and resources. Wherever possible, organizations’ theories of change should refer to relevant IRIS metrics. Organizations are encouraged to footnote information on the defined outcomes they seek to achieve for their targeted stakeholders (e.g., clients, employees, distributors, suppliers, and/or the environment). Defined outcomes include specific targets that can be measured. Many are based on existing literature. Organizations are encouraged to footnote information on the evidence base that substantiates the logic chain linking outputs to defined outcomes. This evidence base might include credible secondary research, randomized control trials (RCT), longitudinal studies, primary research (such as customer surveys or stakeholder feedback forums), and qualitative interviews or case studies. For example, an organization that provides training to and sources from smallholder farmers might only report on the number of farmers trained (Individuals Trained: Total [PI2998]), the number of smallholder farmers sourced from (Supplier Individuals: Smallholder [PI9991]), and the total payments made to those farmers (Payments to Supplier Individuals: Smallho…
defined by: giin

Stormwater Runoff
type: Concept
type: Code
has name: Stormwater Runoff
has description: Volume of water generated from rain and snowmelt flowing over (that is, without soaking into the ground) land indirectly or directly controlled by the organization during the reporting period.
definition: Volume of water generated from rain and snowmelt flowing over (that is, without soaking into the ground) land indirectly or directly controlled by the organization during the reporting period.
has identifier: OD6737
notation: OD6737
had primary source: OD6737
note: Organizations should footnote all assumptions used, including which tools or methodologies were used to measure stormwater runoff.
scope note: This metric is intended to capture the volume of water that runs off (flows over without being absorbed by) land indirectly or directly controlled by the organization during the reporting period. Organizations may use modeling tools to calculate the volume of stormwater runoff. For small sites, the U.S. EPA's National Stormwater Calculator (https://www.epa.gov/water-research/national-stormwater-calculator) and the Green Values National Stormwater Management Calculator (https://greenvalues.cnt.org/national/calculator.php) may be useful. For larger sites, the U.S. EPA's Storm Water Management Model (SWMM; https://www.epa.gov/water-research/storm-water-management-model-swmm) or HydroCAD (https://www.hydrocad.net) may be useful.
defined by: giin

Location of Organization's Headquarters
type: Concept
type: Code
has name: Location of Organization's Headquarters
has description: Address of the organization's legally incorporated headquarters.
definition: Address of the organization's legally incorporated headquarters.
has identifier: OD6855
notation: OD6855
had primary source: OD6855
scope note: This metric is intended to capture the organization’s headquarters location. The term “headquarters” denotes the location where most, if not all, of the important functions of an organization are coordinated. Organizations are encouraged to include the full address of the headquarters including Street Name and Number, District/City, Postal Code, and Country.
defined by: giin

Report Start Date
type: Concept
type: Code
has name: Report Start Date
has description: Start date of the reporting period for which the organization is providing data.
definition: Start date of the reporting period for which the organization is providing data.
has identifier: OD6951
notation: OD6951
had primary source: OD6951
note: Organizations should separately footnote the day, month, and year of the reporting period start date.
scope note: This metric is intended to capture the starting point of the time period for which reported data applies. This metric should be used in conjunction with Report End Date (OD7111).
defined by: giin

Report End Date
type: Concept
type: Code
has name: Report End Date
has description: End date of the reporting period for which the organization is providing data.
definition: End date of the reporting period for which the organization is providing data.
has identifier: OD7111
notation: OD7111
had primary source: OD7111
note: Organizations should separately footnote the day, month, and year of the reporting period end date.
scope note: This metric is intended to capture the end point of the time period for which reported data applies. This metric should be used in conjunction with Report Start Date (OD6951).
defined by: giin

Target Stakeholders
type: Concept
type: Code
has name: Target Stakeholders
has identifier: OD7212
notation: OD7212
had primary source: OD7212
note: Organizations should footnote all assumptions used.
scope note: This metric is intended to capture the target stakeholders of the organization's activities, including the intended recipients of the organization's products, services, and operations. Organizations can benefit people and planet throughout their supply and distribution chains, in their provision of products or services, and through their operations. Some examples follow: - An organization that produces wind power from wind farms, mitigating climate change, could indicate the planet as its target stakeholder. - An organization buying mangoes from co-operatives that source from smallholder farmers could indicate suppliers as its target stakeholder. - An organization that recruits, trains, and employs chronically underemployed populations could indicate employees as its target stakeholder. - An organization engaging women in poor rural areas as distributors of its products and services could indicate distributors as its target stakeholder. - An organization manufacturing and selling water purification tablets could indicate clients as its target stakeholder. Organizations are encouraged to report IRIS metrics related to numbers reached and other key performance indicators (KPIs). For instance, the example organization above that buys mangoes might also report Supplier Individuals: Smallholder (PI9991) and Payments to Supplier Individuals: Smallholder (PI7852). Organizations are also encouraged to report this metric in conjunction with Relationship to Target Stakeholders (OD7900). For planet-related stakeholders, organizations are encouraged to use this metric in conjunction with Target Stakeholder Ecoregion (PD2854), Target Stakeholder Setting (PD6384), Target Area Protected Status (PD1676), and Target Stakeholder Geography (PD6424). This metric may help describe the WHO dimension of impact, which details which stakeholders the investment or enterprise aims to reach with the outcome. This metric may also help clarify how underserved they were prior to the investment. F…
has description: Describes which entities the organization seeks to benefit through its products, services, and operations as of the end of the reporting period. Choose all that apply: - Planet - Suppliers - Employees - Distributors - Clients (for example, students, patients, residents, or smallholders) - Microenterprises - Small and medium-sized enterprises (SMEs) - Other
definition: Describes which entities the organization seeks to benefit through its products, services, and operations as of the end of the reporting period. Choose all that apply: - Planet - Suppliers - Employees - Distributors - Clients (for example, students, patients, residents, or smallholders) - Microenterprises - Small and medium-sized enterprises (SMEs) - Other
defined by: giin

Water Type
type: Concept
type: Code
has name: Water Type
has identifier: OD7536
notation: OD7536
had primary source: OD7536
note: Organizations should footnote all assumptions used.
scope note: This metric is intended to capture the type of water (for example, groundwater, industrial water, or surface water) withdrawn, consumed, or discharged during the reporting period. Specifically, this metric is intended to support the disaggregation of Water Withdrawn (OI0263), Water Discharged (OI0386), and Water Consumed: Total (OI1697) by type of water. For further guidance on water types, see the IRIS+ glossary.
has description: Describes the type of water withdrawn, consumed, or discharged as a result of investments made by the organization during the reporting period. Choose all that apply: - Rainwater - Recycled Water - Groundwater - Surface Water - Seawater - Third Party: Municipal - Third Party: Wastewater - Other (describe)
definition: Describes the type of water withdrawn, consumed, or discharged as a result of investments made by the organization during the reporting period. Choose all that apply: - Rainwater - Recycled Water - Groundwater - Surface Water - Seawater - Third Party: Municipal - Third Party: Wastewater - Other (describe)
defined by: giin

Organization Web Address
type: Concept
type: Code
has name: Organization Web Address
has description: Web address (URL) of the organization.
definition: Web address (URL) of the organization.
has identifier: OD7796
notation: OD7796
had primary source: OD7796
note: Organizations should footnote all assumptions used.
scope note: This metric is intended to capture the primary website address (URL) where the organization offers public-facing information about itself.
defined by: giin

Relationship to Target Stakeholders
type: Concept
type: Code
has name: Relationship to Target Stakeholders
has description: Describes the relationship between the organization and its target stakeholders.
definition: Describes the relationship between the organization and its target stakeholders.
has identifier: OD7900
notation: OD7900
had primary source: OD7900
note: Organizations should footnote all assumptions used.
scope note: This metric is intended to capture the relationships that link the organization to its intended stakeholders. Organizations are encouraged to report on this metric in conjunction with Target Stakeholders (OD7212). When reporting against this metric, organizations should qualitatively describe the relationship between their activities and their target stakeholders, as indicated under Target Stakeholders (OD7212), focusing primarily on the number and types of intermediaries. For example, an organization manufacturing solar lanterns and distributing them through a network of distributors might respond: "We target clients and distributors as our stakeholders. The end users of the solar lanterns (clients) benefit from gaining access to clean electricity and light, and the distributors/retailers of the solar lanterns benefit by having jobs and income." An organization that procures produce from farmers might respond: "The smallholder farmers that supply the mangoes to the organization to produce mango juice are our target stakeholders. A portion of the mangoes are purchased directly from farmers, and the remaining mangoes are purchased from a local cooperative which purchases directly from farmers."
defined by: giin

Client Model
type: Concept
type: Code
has name: Client Model
has identifier: OD8350
notation: OD8350
had primary source: OD8350
note: Organizations should footnote a detailed description about how it reaches its clients.
scope note: This metric is intended to capture the type of relationship between the organization and its clients. In a Business-to-Business client model, the organization sells its goods or services to other businesses, formally or informally. In a Business-to-Consumer client model, the organization sells its goods or services to end consumers, whether individuals, households, or communities. In a Business-to-Government client model, the organization sells or provides its goods or services to government agencies. In a Peer-to-Peer client model, the organization matches client individuals with services to offer to other client individuals who could use that service. For example, the organization may provide an online platform or other means of facilitating such transactions between clients.
has description: Describes the client model of the organization. Select all that apply: - Business-to-Business (B2B) - Business-to-Consumer (B2C) - Business-to-Government (B2G) - Peer-to-Peer (P2P)
definition: Describes the client model of the organization. Select all that apply: - Business-to-Business (B2B) - Business-to-Consumer (B2C) - Business-to-Government (B2G) - Peer-to-Peer (P2P)
defined by: giin

Type of Financial Institution
type: Concept
type: Code
has name: Type of Financial Institution
has identifier: OD9109
notation: OD9109
had primary source: OD9109
note: Organizations should footnote their type of financial institution if they select “Other.”
scope note: This metric is intended to capture organizations’ type(s) of financial institution in a standardized format. Organizations fitting more than one category should select multiple response options.
has description: Describes what type of financial institution the organization is, if applicable. Select all that apply: - Community Action Agency (CAA) - Community Development Financial Institution (CDFI) - Credit Union/Cooperative - Loan Fund, including microenterprise fund or Multibank Community Development Corporation (CDC) - Non-Banking Financial Institution/Non-Banking Financial Corporation (NBFI/NBFC) - Non-Profit/Non-Governmental Organization, including Community Development Corporation (CDCs) - Rural Bank - Thrift, Bank, Bank Holding Company - Venture Capital Fund - Other
definition: Describes what type of financial institution the organization is, if applicable. Select all that apply: - Community Action Agency (CAA) - Community Development Financial Institution (CDFI) - Credit Union/Cooperative - Loan Fund, including microenterprise fund or Multibank Community Development Corporation (CDC) - Non-Banking Financial Institution/Non-Banking Financial Corporation (NBFI/NBFC) - Non-Profit/Non-Governmental Organization, including Community Development Corporation (CDCs) - Rural Bank - Thrift, Bank, Bank Holding Company - Venture Capital Fund - Other
defined by: giin

Employees Receiving Regular Performance and Career Development Reviews
type: Concept
type: Code
has name: Employees Receiving Regular Performance and Career Development Reviews
has description: Number of permanent and temporary workers who received a routine and regular performance and career development review during the reporting period.
definition: Number of permanent and temporary workers who received a routine and regular performance and career development review during the reporting period.
has identifier: OI0112
notation: OI0112
had primary source: OI0112
note: Organizations should footnote all assumptions used.
scope note: This metric is intended to capture the number of employees who received a regular, routine performance and career development review during the reporting period. To qualify under this metric, reviews must be based on clear criteria understood by both the manager and employee, must occur with adequate notice to the employee, and must occur at least once per year. A review may—but is not required to—include an evaluation by the employee’s direct superior, their peers, a wider range of employees, or the human resources department, as well as the employee's own reflections on their quality of work. This metric is sourced from Disclosure 404-3 in GRI 404: Training and Education 2016: Percentage of employees receiving regular performance and career development reviews. Regular performance reviews support the professional development of employees, contribute to skills management, and build human capital within the organization. Such reviews can also increase employee satisfaction, which can improve organizational performance. This metric may help describe the HOW MUCH Scale dimension, which helps estimate the number of the targeted stakeholders experiencing the outcome. For more on the alignment of IRIS metrics to the five dimensions of impact, see IRIS+ and the Five Dimensions of Impact (https://iris.thegiin.org/document/iris-and-the-five-dimensions/). No single metric is sufficient to understand an impact; rather, metrics are selected as a set across all dimensions of impact. The selection of metrics to measure and describe the five dimensions should be based on best practice and evidence.
defined by: giin

Water Withdrawn
type: Concept
type: Code
has name: Water Withdrawn
has description: Volume of all water drawn from surface water, groundwater, seawater, or a third party for any use by the organization during the reporting period.
definition: Volume of all water drawn from surface water, groundwater, seawater, or a third party for any use by the organization during the reporting period.
has identifier: OI0263
notation: OI0263
had primary source: OI0263
note: Organizations should footnote all assumptions used, including source(s) of data.
scope note: This metric is intended to capture the amount of water withdrawn by the organization from any source and for any purpose during the reporting period. This metric aligns with GRI's Disclosure 303 and may be combined with Water Type (OD7536) to describe in greater detail from where water was withdrawn. In some contexts, this metric can serve as an indicator of whether the outcome being sought by an investor or organization is occurring (the WHAT dimension of impact). For more on the alignment of IRIS metrics to the five dimensions of impact, see IRIS+ and the Five Dimensions of Impact (https://iris.thegiin.org/document/iris-and-the-five-dimensions/). No single metric is sufficient to understand an impact; rather, metrics are selected as a set across all dimensions of impact. When possible, the selection of metrics to measure and describe the five dimensions should be based on best practice and evidence.
defined by: giin

Water Discharged
type: Concept
type: Code
has name: Water Discharged
has description: Volume of effluents, used water, and unused water released, during the reporting period, to surface water, groundwater, seawater, or a third party and for which the organization has no further use.
definition: Volume of effluents, used water, and unused water released, during the reporting period, to surface water, groundwater, seawater, or a third party and for which the organization has no further use.
has identifier: OI0386
notation: OI0386
had primary source: OI0386
note: Organizations should footnote all assumptions used, including source(s) of data.
scope note: This metric is intended to capture the amount of water discharged by the organization to any source and for any purpose during the reporting period. This metric is sourced from GRI's Disclosure 303 and may be combined with Water Type (OD7536) to describe to where water was discharged in greater detail. In some contexts, this metric can serve as an indicator of whether the outcome being sought by an investor or organization is occurring (the WHAT dimension of impact). For more on the alignment of IRIS metrics to the five dimensions of impact, see specific guidance document. No single metric is sufficient to understand an impact; rather, metrics are selected as a set across all dimensions of impact. When possible, the selection of metrics to measure and describe the five dimensions should be based on best practice and evidence.
defined by: giin

Average Daily Traffic
type: Concept
type: Code
has name: Average Daily Traffic
has description: Average number of vehicles per day using an urban road over the course of a year.
definition: Average number of vehicles per day using an urban road over the course of a year.
has identifier: OI0659
notation: OI0659
had primary source: OI0659
note: Organizations should footnote all assumptions used, including source(s) of data.
scope note: This metric is intended to capture the volume of traffic in a particular market or context, expressed as the average number of vehicles using an urban road per day over the course of a year. Organizations may also choose to report average traffic for other periods of time (e.g., traffic per month). Traffic on a road, particularly over time, serves as a proxy for the qualitative contribution of new transportation infrastructure to economic activity. Providers of GPS traffic data frequently offer traffic counts by side of road, day of week, and time of day. International Finance Institutions (IFIs) often use this metric as part of transportation analysis. If toll roads are not part of a project, this metric is not a good indicator of impact performance, unless the corresponding transport or transit agency monitors traffic congestion.
defined by: giin

Leadership Demographics
type: Concept
type: Code
has name: Leadership Demographics
has identifier: OI0667
notation: OI0667
had primary source: OI0667
has description: Describes the demographic groups in leadership of the organization, or disaggregates another metric in terms of one or more demographic groups in leadership. Partic ular thresholds apply to consider an organization "led" by members of a demographic group; see usage guidance for further information. Select all that apply: Gender: - 30% of Greater Female or Gender Non-Binary - Undisclosed - Other Disability Status: - Persons with disabilities - Persons without disabilities - Undisclosed - Other Race/Ethnicity/Minority Status: - Historically marginalized groups - Dominant culture populations - Undisclosed - Other Other target populations: - Other (describe)
definition: Describes the demographic groups in leadership of the organization, or disaggregates another metric in terms of one or more demographic groups in leadership. Partic ular thresholds apply to consider an organization "led" by members of a demographic group; see usage guidance for further information. Select all that apply: Gender: - 30% of Greater Female or Gender Non-Binary - Undisclosed - Other Disability Status: - Persons with disabilities - Persons without disabilities - Undisclosed - Other Race/Ethnicity/Minority Status: - Historically marginalized groups - Dominant culture populations - Undisclosed - Other Other target populations: - Other (describe)
note: Organizations should footnote all assumptions used, including source of data or disaggregation and any other disaggregations applied.
scope note: This metric is intended to capture the basic demographic groups in an organization's leadership. The thresholds by group follow these sources: - Gender: 30% female or gender non-binary in senior leadership (C-suite) or on the Board or Investment Committee, following the 2X Challenge criteria (https://www.2xchallenge.org/criteria). This disaggregation, applied to another metric, is intended to capture the share of that metric which relates to the selected demographic groups in leadership. For example, when applied to Client Organizations (PI9652), this disaggregation would capture the number of client organizations with leadership in the selected demographic group(s). Individuals in leadership should self-report their own demographic data to ensure accuracy, particularly for race and gender. Organizations should not assume gender for an individual and should protect vulnerable individuals in the LGBTQIA+ spectrum by reporting these data anonymously and in aggregate. Given that transwomen are women and transmen are men, this metric does not create separate segmentations for those groups. However, organizations are encouraged to create additional groupings using the write-in option as needed to capture those lived experiences that are helpful in understanding equity in outcomes.
defined by: giin

Market Linkages Improved or Expanded
type: Concept
type: Code
has name: Market Linkages Improved or Expanded
has description: Describes whether the organization improved existing market linkages or engaged new or additional forward or backward market linkages, including through its own integration, during the reporting period.
definition: Describes whether the organization improved existing market linkages or engaged new or additional forward or backward market linkages, including through its own integration, during the reporting period.
has identifier: OI0685
notation: OI0685
had primary source: OI0685
note: Organizations should footnote all assumptions used, including source(s) of data.
scope note: This metric is intended to capture the organization’s improvement of existing market linkages or acquisition of new kinds of forward or backward market linkages to expand market access. Forward and backward refer to upstream and downstream supply-chain linkages rather than commodities contracts. Examples of forward linkages include the sale of value-added goods and services to other firms or customers, such as the supply of fertilizers by manufacturing companies to agricultural firms, while backward linkages include the purchase of inputs from suppliers and service providers, such as sourcing raw materials for manufacturing or agro-processing. “Improved” refers to those linkages that the organization believes will add value to its market expansion, whether caused by improvements in technology use or by cheaper or faster service delivery. Linkages may be developed through licensing agreements, new domestic supplier sources, or international sourcing and distribution, among other means. This metric differs from Business Innovation (OI4718), which is intended to track the organization’s development of innovative products and services. International Finance Institutions (IFIs) often use this metric as part of their analysis of private sector development.
defined by: giin

Founder Demographics
type: Concept
type: Code
has name: Founder Demographics
has identifier: OI0933
notation: OI0933
had primary source: OI0933
note: Organizations should footnote all assumptions used, including source of data or disaggregation and any other disaggregations applied.
scope note: This metric is intended to capture the basic demographic groups in among an organization's founder(s) who retain an active role at the organization as of the end of the reporting period. An active role may include acting in an advisory capacity for key decisions and does not necessarily require a full-time role at the organization. The thresholds by group follow these sources: - Gender: 50% female or gender non-binary, following the 2X Challenge criteria (https://www.2xchallenge.org/criteria) as interpreted by the Joint Impact Indicators. - Race/Ethnicity: 50% from a historically marginalized groups, by analogue to Gender. This disaggregation, applied to another metric, is intended to capture the share of that metric which relates to the selected demographic groups among founders. For example, when applied to Client Organizations (PI9652), this disaggregation would capture the number of client organizations founded by members of the selected demographic group(s). Founders should self-report their own demographic data to ensure accuracy, particularly for race and gender. Organizations should not assume gender for an individual and should protect vulnerable individuals in the LGBTQIA+ spectrum by reporting these data anonymously and in aggregate. Given that transwomen are women and transmen are men, this metric does not create separate segmentations for those groups. However, organizations are encouraged to create additional groupings using the write-in option as needed to capture those lived experiences that are helpful in understanding equity in outcomes.
has description: Describes the demographic groups among founders of the organization, or disaggregates another metric in terms of one or more founder demographic groups. Particular thresholds apply to consider an organization "founded" by members of a demographic group; see usage guidance for further information. Select all that apply: Gender: - 50% or More Female or Gender Non-Binary - Undisclosed - Other Disability Status: - Persons with disabilities - Persons without disabilities - Undisclosed - Other Race/Ethnicity/Minority Status: - 50% or More from Historically Marginalized Groups - Undisclosed - Other Other target populations: - Other (describe)
definition: Describes the demographic groups among founders of the organization, or disaggregates another metric in terms of one or more founder demographic groups. Particular thresholds apply to consider an organization "founded" by members of a demographic group; see usage guidance for further information. Select all that apply: Gender: - 50% or More Female or Gender Non-Binary - Undisclosed - Other Disability Status: - Persons with disabilities - Persons without disabilities - Undisclosed - Other Race/Ethnicity/Minority Status: - 50% or More from Historically Marginalized Groups - Undisclosed - Other Other target populations: - Other (describe)
defined by: giin

Vehicle/Container Inactive Hours
type: Concept
type: Code
has name: Vehicle/Container Inactive Hours
has description: Average number of hours spent inactive or waiting (inclusive of turnaround and dwell time) by a vehicle or container during the reporting period.
definition: Average number of hours spent inactive or waiting (inclusive of turnaround and dwell time) by a vehicle or container during the reporting period.
has identifier: OI1010
notation: OI1010
had primary source: OI1010
note: Organizations should footnote all assumptions used, including source of data and specific transportation context.
scope note: This metric is intended to capture the average number of hours a vehicle or container spends inactive or waiting (including turnaround and dwell time) during the reporting period. This metric indicates service quality and can be used to capture turnaround time for cargo and passenger vehicles; average waiting time for ships, busses, and trains, and other related measures. Organizations should footnote the specific and relevant context to which their report applies. This metric is often used by International Finance Institutions (IFIs) as part of transportation analysis.
defined by: giin

Number of Employee Grievances Registered
type: Concept
type: Code
has name: Number of Employee Grievances Registered
has description: Number of formal grievances registered by employees of the organization during the reporting period.
definition: Number of formal grievances registered by employees of the organization during the reporting period.
has identifier: OI1042
notation: OI1042
had primary source: OI1042
note: Organizations should footnote all assumptions used.
scope note: This metric is intended to capture the number of grievances that were formally entered into the organization's employee grievance mechanism during the reporting period. This metric does not capture the number of grievances resolved or dismissed during the reporting period, which should be reported under Number of Employee Grievances Resolved (OI9077). To capture whether the organization has an employee grievance and feedback system in general, organizations should use Employee Feedback and Grievance System (OI3601). Organizations are also encouraged to footnote the ownership of the mechanism, the purpose of the mechanism and its relationship to other grievance mechanisms, the organization’s activities that are covered by the mechanism, the intended users of the mechanism, how the mechanism is managed, the process to address and resolve grievances (including how decisions are made), and the effectiveness criteria used (see GRI 103-2). Effective grievance mechanisms should be legitimate, accessible, predictable, equitable, transparent, rights-compatible, and a source of continuous learning (GRI 2018). For operational-level mechanisms to be effective, they should be based on engagement and dialogue. For a description of each of these criteria, see Guiding Principle 31. United Nations (UN), ‘Guiding Principles on Business and Human Rights, Implementing the United Nations “Protect, Respect and Remedy” Framework,’ 2011. This metric may help describe the HOW MUCH Scale dimension, which helps estimate the number of the targeted stakeholders experiencing the outcome. For more on the alignment of IRIS metrics to the five dimensions of impact, see IRIS+ and the Five Dimensions of Impact (https://iris.thegiin.org/document/iris-and-the-five-dimensions/). No single metric is sufficient to understand an impact; rather, metrics are selected as a set across all dimensions of impact. The selection of metrics to measure and describe the five dimensions should be based on best practice…
defined by: giin

Soil Health Practices
type: Concept
type: Code
has name: Soil Health Practices
has identifier: OI1047
notation: OI1047
had primary source: OI1047
note: Organizations should footnote all assumptions used, including descriptions of soil health practices and methods used, their frequency of application, description of soil health characteristics, and details of nutrient management plans.
scope note: This metric is intended to capture the practices the organization employs to support and improve soil health. Good soil health supports multiple positive outcomes, including more nutritious foods and more stable yields. Examples of regionally appropriate soil health improvement practices, to footnote, include low tillage systems, cover cropping, addition of soil amendments, and crop residue usage. This metric aligns with the Leading Harvest (https://www.leadingharvest.org/standard) Performance Measure 2.1 on Soil Health.
has description: Indicates which sustainable agriculture best practices the organization implemented to maintain and enhance soil health of agricultural lands during the reporting period. Select all that apply: - Application of regionally appropriate soil health improvement practices to maintain or enhance soil fertility and the physical and biological characteristics of soil - Monitoring of those soil health characteristics, including nutrients from different sources, that are necessary to maintain or enhance appropriate nutrient balance and soil health - Development and maintenance of an up-to-date nutrient management program that efficiently uses nutrient inputs and nutrients in the soil and crops to create optimum conditions for production and avoids nutrient loss to water and air - Other (describe) - Undisclosed
definition: Indicates which sustainable agriculture best practices the organization implemented to maintain and enhance soil health of agricultural lands during the reporting period. Select all that apply: - Application of regionally appropriate soil health improvement practices to maintain or enhance soil fertility and the physical and biological characteristics of soil - Monitoring of those soil health characteristics, including nutrients from different sources, that are necessary to maintain or enhance appropriate nutrient balance and soil health - Development and maintenance of an up-to-date nutrient management program that efficiently uses nutrient inputs and nutrients in the soil and crops to create optimum conditions for production and avoids nutrient loss to water and air - Other (describe) - Undisclosed
defined by: giin

Wastewater Removed
type: Concept
type: Code
has name: Wastewater Removed
has description: Volume of wastewater safely removed from client premises by the organization during the reporting period.
definition: Volume of wastewater safely removed from client premises by the organization during the reporting period.
has identifier: OI1054
notation: OI1054
had primary source: OI1054
note: Organizations should footnote all assumptions used.
scope note: This metric is intended to capture how much wastewater was safely and hygienically removed from client households or businesses, including wastewater that has both been and not yet been treated. These are administrative data and should come from the service provider (for example, the utility company). Organizations are encouraged to report these data in cubic meters.
defined by: giin

Board of Directors: Total
type: Concept
type: Code
has name: Board of Directors: Total
has description: Number of members of the organization's board of directors or other governing body as of the end of the reporting period.
definition: Number of members of the organization's board of directors or other governing body as of the end of the reporting period.
has identifier: OI1075
notation: OI1075
had primary source: OI1075
note: Organizations should footnote all assumptions used.
scope note: This metric is intended to capture the overall size of the organization’s board of directors or governing body. A board of directors is a group of individuals legally responsible to govern a corporation and responsible to the shareholders and other relevant stakeholders. A governing body with a different name (e.g., "advisory body") may be considered a Board of Directors provided it has a fiduciary and/or social responsibility to shareholders and/or other relevant stakeholders. This metric is multi-dimensional with regard to the five dimensions of impact. It may help describe the WHO dimension when the stakeholder group represented by the metric is the stakeholder group targeted by the investment or organization. It may also help measure the HOW MUCH Scale dimension, which helps estimate the number of the targeted stakeholders experiencing the outcome. For more on the alignment of IRIS metrics to the five dimensions of impact, see IRIS+ and the Five Dimensions of Impact (https://iris.thegiin.org/document/iris-and-the-five-dimensions/). No single metric is sufficient to understand an impact; rather, metrics are selected as a set across all dimensions of impact. When possible, the selection of metrics to measure and describe the five dimensions should be based on best practice and evidence.
defined by: giin

Permanent Employee Wages: Historically Marginalized
type: Concept
type: Code
has name: Permanent Employee Wages: Historically Marginalized
has description: Value of wages (including bonuses and excluding benefits) paid to all full- and part-time employees of the organization during the reporting period who belong to groups historically marginalized on the basis of race and/or ethnicity.
definition: Value of wages (including bonuses and excluding benefits) paid to all full- and part-time employees of the organization during the reporting period who belong to groups historically marginalized on the basis of race and/or ethnicity.
has identifier: OI1084
notation: OI1084
had primary source: OI1084
note: Organizations should footnote all assumptions used, including their categorization of historically marginalized groups. See usage guidance for further information.
scope note: This metric is intended to capture pre-tax wages and salaries paid to the organization's full- and part-time employees who belong to historically marginalized groups and should include neither benefits nor payroll expenses. This metric should exclude Temporary Employee Wages (OI4202). The categorization of historically marginalized groups varies with location and context. With no internationally agreed-upon definition as to which groups constitute historically marginalized on the basis of race and/or ethnicity, if well-established local policies exist (as in South Africa, with the Broad Based Black Economic Empowerment [BBBEE] definition of historically marginalized, or in India, based on backward caste), organizations should refer to these local guidelines to identify groups historically marginalized on the basis of race and/or ethnicity. Otherwise, and wherever appropriate, organizations should provide additional detail regarding their tailored methodology for defining these groups.
defined by: giin

Operational Certifications
type: Concept
type: Code
has name: Operational Certifications
has description: Describes the third-party, business process- and practice-related certifications that the organization holds as of the end of the reporting period. See usage guidance for further information.
definition: Describes the third-party, business process- and practice-related certifications that the organization holds as of the end of the reporting period. See usage guidance for further information.
has identifier: OI1120
notation: OI1120
had primary source: OI1120
note: Organization should footnote the details on each certification, including the certification name, certifying body, and date of certification.
scope note: This metric is intended to capture third-party certifications that the organization holds as of the end of the reporting period and that are related to business process and practice. For example, organizations providing healthcare delivery services might hold SafeCare certification, ISO 900 certification, and government accreditation. Organizations wishing to report product-level certifications should report on Product/Service Certifications (PD2756). Since certifications vary by sector (for example, construction, textiles or manufacturing, agribusiness, supply chain development), organizations should disclose the type of certification held, as well as whether the certification is issued by an internationally recognized certifying authority and, if so, which one.
defined by: giin

Fair Hiring/Recruiting Policy
type: Concept
type: Code
has name: Fair Hiring/Recruiting Policy
has description: Indicates whether the organization has a written employment policy to recruit employees fairly and equally and a system to monitor compliance with this policy.
definition: Indicates whether the organization has a written employment policy to recruit employees fairly and equally and a system to monitor compliance with this policy.
has identifier: OI1150
notation: OI1150
had primary source: OI1150
note: Organizations should footnote details about their hiring and recruiting policies, as well as how these policies are being implemented.
scope note: This metric is intended to capture how organizations consider diversity and inclusion during hiring and recruiting. Organizations should consider reporting this metric in combination with Fair Career Advancement Policy (OI1150).
defined by: giin

Volunteer Hours
type: Concept
type: Code
has name: Volunteer Hours
has description: Number of hours worked by non-employee volunteers who supported the organization during the reporting period.
definition: Number of hours worked by non-employee volunteers who supported the organization during the reporting period.
has identifier: OI1166
notation: OI1166
had primary source: OI1166
note: Organizations should footnote all assumptions used.
scope note: This metric is intended to capture the number of hours worked by volunteers who are not employees of the organization. Organizations interested in reporting information on employee volunteer hours can refer to Community Service Hours Contributed (OI8429).
defined by: giin

Environmental Management System
type: Concept
type: Code
has name: Environmental Management System
has description: Indicates whether the organization has an environmental management system in place.
definition: Indicates whether the organization has an environmental management system in place.
has identifier: OI1254
notation: OI1254
had primary source: OI1254
note: Organizations should footnote relevant details about their environmental management system and how it is being implemented. See usage guidance for further information.
scope note: This metric is intended to capture whether an organization has implemented an environmental management system. Examples of details on an environmental management system to footnote may include whether there are written policy documents, stated objectives and targets, relevant programming, and periodic auditing and evaluation practices. Organizations can refer to the following sources for further guidance on environmental management systems: - United States Environmental Protection Agency (http://www.epa.gov/ems/) - International Organization for Standardization (http://www.iso.org/iso/home/standards/management-standards/iso14000.htm)
defined by: giin

Waste Produced: Hazardous Waste
type: Concept
type: Code
has name: Waste Produced: Hazardous Waste
has description: Amount of hazardous waste created by the organization's operations during the reporting period.
definition: Amount of hazardous waste created by the organization's operations during the reporting period.
has identifier: OI1346
notation: OI1346
had primary source: OI1346
note: Organizations should footnote all assumptions used. See usage guidance for further information.
scope note: This metric is intended to capture the amount of hazardous waste the organization’s operations create during the reporting period, defined as refuse that could present dangers by contaminating and polluting the environment. Hazardous waste requires special disposal techniques to make it harmless or less dangerous. Specific classification of hazardous waste, which organizations should footnote, is typically defined by local legislation. Organizations are also encouraged to footnote the methods employed to ensure that hazardous waste is disposed of responsibly.
defined by: giin

Greenhouse Gas Emissions: Total
type: Concept
type: Code
has name: Greenhouse Gas Emissions: Total
has description: Amount of greenhouse gases (GHG) emitted as a result of the organization's operations during the reporting period.
definition: Amount of greenhouse gases (GHG) emitted as a result of the organization's operations during the reporting period.
has identifier: OI1479
notation: OI1479
had primary source: OI1479
note: Organizations should footnote all assumptions used, including detailed information on their calculation methodology and source of data. See usage guidance for further information.
scope note: This metric is intended to capture the total amount of greenhouse gases emitted during the reporting period. To disaggregate by scope (that is, source) of greenhouse gas emissions, organizations are encouraged to report Greenhouse Gas Emissions Scopes (OI5732), which allows for disaggregation by GHG Protocol Scopes 1–3. For tools that may be helpful in calculating this and related metrics, see GHG Protocol Calculators (https://ghgprotocol.org/calculation-tools). Organizations can also report Greenhouse Gas Emissions Strategy (OI8237). This metric should include emissions from both direct and indirect sources. In some contexts, this metric can serve as an indicator of whether the outcome being sought by an investor or organization is occurring (the WHAT dimension of impact). For more on the alignment of IRIS metrics to the five dimensions of impact, see IRIS+ and the Five Dimensions of Impact (https://iris.thegiin.org/document/iris-and-the-five-dimensions/). No single metric is sufficient to understand an impact; rather, metrics are selected as a set across all dimensions of impact. When possible, the selection of metrics to measure and describe the five dimensions should be based on best practice and evidence.
defined by: giin

Energy Generated for Use: Non-Renewable
type: Concept
type: Code
has name: Energy Generated for Use: Non-Renewable
has description: Amount of energy both generated and consumed by the organization from non-renewable sources during the reporting period.
definition: Amount of energy both generated and consumed by the organization from non-renewable sources during the reporting period.
has identifier: OI1495
notation: OI1495
had primary source: OI1495
note: Organizations should footnote all assumptions used.
scope note: NOTE: This metric will be deprecated in a forthcoming update to the IRIS Catalog of Metrics. Users are advised to instead report Energy Generated for Use: Total (OI9624) disaggregated by Primary Energy Source (OI3781), all options under Non-Renewable. This metric is intended to capture the amount of non-renewable energy produced and used by the organization itself. For example, if an organization builds its own natural gas plant and uses this generated energy for its factories, it would report the amount of energy produced and used from that source under this metric. Non-renewable energy sources include coal, natural gas, and crude oil derivatives, among other forms. Organizations may refer to the glossary for additional information. Organizations wishing to report on the amount of renewable energy generated for sale should report Energy Generated for Sale: Renewable (PI5842). In some contexts, this metric can serve as an indicator of whether the outcome being sought by an investor or organization is occurring (the WHAT dimension of impact). For more on the alignment of IRIS metrics to the five dimensions of impact, see IRIS+ and the Five Dimensions of Impact (https://iris.thegiin.org/document/iris-and-the-five-dimensions/). No single metric is sufficient to understand an impact; rather, metrics are selected as a set across all dimensions of impact. When possible, the selection of metrics to measure and describe the five dimensions should be based on best practice and evidence.
defined by: giin

Energy Purchased: Non-Renewable
type: Concept
type: Code
has name: Energy Purchased: Non-Renewable
has description: Amount of purchased energy consumed by the organization from non-renewable sources during the reporting period.
definition: Amount of purchased energy consumed by the organization from non-renewable sources during the reporting period.
has identifier: OI1496
notation: OI1496
had primary source: OI1496
note: Organizations should footnote all assumptions used, including source of data.
scope note: NOTE: This metric will be deprecated in a forthcoming update to the IRIS Catalog of Metrics. Users are advised to instead report Energy Purchased: Total (OI8825), disaggregated by Primary Energy Source (OI3781), all options under Non-Renewable. This metric is intended to capture the amount of non-renewable energy purchased for use by the organization itself. Non-renewable energy sources include coal, natural gas, and crude oil derivatives, among other forms. Organizations may refer to the glossary for additional information. In some contexts, this metric can serve as an indicator of whether the outcome being sought by an investor or organization is occurring (the WHAT dimension of impact). For more on the alignment of IRIS metrics to the five dimensions of impact, see IRIS+ and the Five Dimensions of Impact (https://iris.thegiin.org/document/iris-and-the-five-dimensions/). No single metric is sufficient to understand an impact; rather, metrics are selected as a set across all dimensions of impact. When possible, the selection of metrics to measure and describe the five dimensions should be based on best practice and evidence.
defined by: giin

Healthcare Benefits Premium Covered
type: Concept
type: Code
has name: Healthcare Benefits Premium Covered
has description: Percentage of a full-time employee's healthcare premium that is covered by the organization or third parties, based on benefits available to full-time employees as of the end of the reporting period.
definition: Percentage of a full-time employee's healthcare premium that is covered by the organization or third parties, based on benefits available to full-time employees as of the end of the reporting period.
has identifier: OI1503
notation: OI1503
had primary source: OI1503
note: Organizations should footnote all assumptions used, including source of data. See usage guidance for further information.
scope note: This metric is intended to capture the share of healthcare premiums covered for employees, whether covered directly by the organization or by regional governmental programs in the region of operations. Organizations should provide a weighted average by number of employees if the percentage differs among them. Subtracting this percentage from 1 (one) would give the percentage that employees were responsible for covering. In some contexts, this metric can serve as an indicator of whether the outcome being sought by an investor or organization is occurring (the WHAT dimension of impact). For more on the alignment of IRIS metrics to the five dimensions of impact, see IRIS+ and the Five Dimensions of Impact (https://iris.thegiin.org/document/iris-and-the-five-dimensions/). No single metric is sufficient to understand an impact; rather, metrics are selected as a set across all dimensions of impact. When possible, the selection of metrics to measure and describe the five dimensions should be based on best practice and evidence.
defined by: giin

Full-time Wages: Historically Marginalized
type: Concept
type: Code
has name: Full-time Wages: Historically Marginalized
has description: Value of wages (including bonuses and excluding benefits) paid to all full-time employees of the organization during the reporting period who belong to groups historically marginalized on the basis of race and/or ethnicity.
definition: Value of wages (including bonuses and excluding benefits) paid to all full-time employees of the organization during the reporting period who belong to groups historically marginalized on the basis of race and/or ethnicity.
has identifier: OI1508
notation: OI1508
had primary source: OI1508
note: Organizations should footnote all assumptions used, including their categorization of historically marginalized groups. See usage guidance for further information.
scope note: This metric is intended to capture pre-tax wages and salaries paid to the organization's full-time employees who belong to historically marginalized groups and should include neither benefits nor payroll expenses. This metric should exclude Temporary Employee Wages (OI4202). The categorization of historically marginalized groups varies with location and context. With no internationally agreed-upon definition as to which groups constitute historically marginalized on the basis of race and/or ethnicity, if well-established local policies exist (as in South Africa, with the Broad Based Black Economic Empowerment [BBBEE] definition of historically marginalized, or in India, based on backward caste), organizations should refer to these local guidelines to identify groups historically marginalized on the basis of race and/or ethnicity. Otherwise, and wherever appropriate, organizations should provide additional detail regarding their tailored methodology for defining these groups.
defined by: giin

Full-time Employees: Female Managers
type: Concept
type: Code
has name: Full-time Employees: Female Managers
has description: Number of paid, full-time, female management employees (managers) at the organization as of the end of the reporting period.
definition: Number of paid, full-time, female management employees (managers) at the organization as of the end of the reporting period.
has identifier: OI1571
notation: OI1571
had primary source: OI1571
note: Organizations should footnote how their organization defines management levels. See usage guidance for further information.
scope note: This metric is intended to capture the number of unique, individual female managers employed by the organization in full-time roles as of the end of the reporting period. This metric excludes Temporary Employees (OI9028). Organizations can refer to the glossary for additional guidance on defining management. The composition of management varies with an organization’s stage and type, but managers are generally responsible for setting objectives (defining goals for the group and deciding what work must be done to meet those goals), organizing (dividing work into manageable activities and selecting the right people to accomplish them), motivating and communicating (creating a team out of individuals through decisions on pay, promotion, and communications), measuring (establishing targets and interpreting and analyzing performance), and developing people. Organizations are also encouraged to footnote if the number reported for this metric includes any female managers in the following positions: Chief Executive Officer or President, Chief Operating Officer, or Chief Financial Officer. To report in line with 2X Challenge requirements, organizations must disaggregate by number of full-time female employees at the Senior Management level using the 2X definition: C-Suite or equivalent (e.g., Managing Directors, Partners). As titles may vary with organizational size and stage, some judgement is required. This metric is multi-dimensional with regard to the five dimensions of impact: it may help describe the WHO dimension when the stakeholder group represented by the metric is the stakeholder group targeted by the investment or organization. It may also help measure the HOW MUCH Scale dimension, which helps estimate the number of the targeted stakeholders experiencing the outcome. For more on the alignment of IRIS metrics to the five dimensions of impact, see IRIS+ and the Five Dimensions of Impact (https://iris.thegiin.org/document/iris-and-the-five-dimensions/). No single met…
defined by: giin

Wage Equity
type: Concept
type: Code
has name: Wage Equity
has description: Ratio of the wages paid during the reporting period to the highest-compensated full-time employee (including bonus and excluding benefits) compared to the lowest-paid full-time employee.
definition: Ratio of the wages paid during the reporting period to the highest-compensated full-time employee (including bonus and excluding benefits) compared to the lowest-paid full-time employee.
has identifier: OI1582
notation: OI1582
had primary source: OI1582
note: Organizations should footnote all assumptions used, including details about the two positions used in the calculation. See usage guidance for further information.
scope note: This metric is intended to capture the distance between the highest and lowest wages in the organization. Organizations with operations in many countries are encouraged to report multiple ratios, with each comparing wages of two employees located in the same country. Organizations should footnote details about the types of positions used in calculating this metric. This ratio can be calculated based on salaried employees with fixed wages or on employees with variable salaries (such as hourly, daily, weekly, other specified time cycle, or other specified parameter). In some contexts, this metric can serve as an indicator of whether the outcome being sought by an investor or organization is occurring (the WHAT dimension of impact). For more on the alignment of IRIS metrics to the five dimensions of impact, see IRIS+ and the Five Dimensions of Impact (https://iris.thegiin.org/document/iris-and-the-five-dimensions/). No single metric is sufficient to understand an impact; rather, metrics are selected as a set across all dimensions of impact. When possible, the selection of metrics to measure and describe the five dimensions should be based on best practice and evidence.
defined by: giin

Threatened Species Policy
type: Concept
type: Code
has name: Threatened Species Policy
has description: Indicates whether the organization implements policies to protect threatened species that reside in habitats affected by the organization's operations.
definition: Indicates whether the organization implements policies to protect threatened species that reside in habitats affected by the organization's operations.
has identifier: OI1618
notation: OI1618
had primary source: OI1618
note: Organizations should footnote details of their policies, how the threatened species are being affected and what is being done to protect them, and how organizations determine which habitats are affected by the organization's operations. See usage guidance for further information.
scope note: This metric is intended to provide detailed information on the threatened species policy or policies in place but does not evaluate the success with which that policy is implemented. Threatened species are any species (including animals, plants, and fungi) which are endangered or likely to become endangered within the foreseeable future throughout all or a significant portion of their range. The term “threatened” captures multiple levels of threat to species: vulnerable, endangered, and critically endangered. Organizations should refer to the glossary for more detail on what is classified as a threatened species. In addition to describing policies to protect threatened species, organizations are encouraged to footnote details on the threatened species that reside in terrestrial or aquatic habitats affected by the organization's operations, as determined by risk categories (e.g., vulnerable, endangered, and critically endangered) developed by recognized authorities such as IUCN (www.iucn.org) or CITES (www.cites.org). IUCN’s Red List of Threatened Species provides information about the global extinction risk faced by animal, plant and fungus species, as well as their range, population size, habitat, and conservation measures. CITES provides information on species threatened by international trade. Local endangered species platforms, such as those provided by the U.S. Fish & Wildlife Service, are also available. Species are categorized in these databases according to their degree of extinction, which suggests a corresponding prioritization of conservation measures for species and their habitats. If reported, organizations should use the common name of each included species. Organizations can compare and verify their categorizations against the lists of the authority they reference. Specialized biodiversity measurement approaches such as IUCN’s STAR can identify which impacts threaten species the most. Organizations are encouraged to report this metric in conjunction w…
defined by: giin

Value of Community Development Contributions
type: Concept
type: Code
has name: Value of Community Development Contributions
has description: Value of payments made by the organization during the reporting period towards activities that benefit local communities.
definition: Value of payments made by the organization during the reporting period towards activities that benefit local communities.
has identifier: OI1619
notation: OI1619
had primary source: OI1619
note: Organizations should footnote all assumptions used, including source(s) of data.
scope note: This metric is intended to capture the value of contributions made with the intent to benefit local communities. This metric is often used by International Financial Institutions (IFIs) to analyze client contributions that are financial in nature. It enables, among other possibilities, the evaluation of contributions for community benefit against total project cost, turnover, profit, or total number of target stakeholders. When establishing a threshold for this comparison, organizations should consider that the level of contributions may need to vary by country, sector, and relevant market of operations. For details on non-financial contributions, refer to Non-Financial Support Offered (PD9681).
defined by: giin

Employee Voluntary Turnover Rate
type: Concept
type: Code
has name: Employee Voluntary Turnover Rate
has description: Ratio of the number of permanent (full- and part-time) employees who departed voluntarily compared to the average number of permanent (full- and part-time) employees at the organization during the reporting period.
definition: Ratio of the number of permanent (full- and part-time) employees who departed voluntarily compared to the average number of permanent (full- and part-time) employees at the organization during the reporting period.
has identifier: OI1638
notation: OI1638
had primary source: OI1638
note: Organizations should footnote all assumptions used. See usage guidance for further information.
scope note: This metric is intended to capture the rate at which permanent employees depart voluntarily. Refer to Departed Permanent Employees: Voluntary (OI8431) for additional information. For employees departing the organization involuntarily, organizations can use the metrics Departed Permanent Employees: Involuntary (OI7225) and Employee Involuntary Turnover Rate (OI3989). The average number of permanent employees can be calculated in several ways. One example for organizations reporting on a yearly basis is to calculate the average number of permanent employees on a monthly basis under Permanent Employees: Total (OI8869). Organizations are also encouraged to report this metric in conjunction with Average Employee Tenure (OI2248). In some contexts, this metric can serve as an indicator of whether the outcome being sought by an investor or organization is occurring (the WHAT dimension of impact). For more on the alignment of IRIS metrics to the five dimensions of impact, see specific guidance document. No single metric is sufficient to understand an impact; rather, metrics are selected as a set across all dimensions of impact. When possible, the selection of metrics to measure and describe the five dimensions should be based on best practice and evidence.
defined by: giin

Land Directly Controlled: Cultivated
type: Concept
type: Code
has name: Land Directly Controlled: Cultivated
has description: Area of land directly controlled by the organization and under cultivation. Report directly controlled land area cultivated during the reporting period.
definition: Area of land directly controlled by the organization and under cultivation. Report directly controlled land area cultivated during the reporting period.
has identifier: OI1674
notation: OI1674
had primary source: OI1674
note: Organizations should footnote details about the nature of the direct control relationship and all assumptions used, including source of data. See usage guidance for further information.
scope note: The IRIS catalog differentiates between land that the organization directly controls and land that the organization indirectly controls. This metric is intended to capture the area of land that is under the organization's direct control. Direct control refers to land for which the organization controls land use through direct operation or management, including situations in which the organization's employees cultivate the land directly. Note that land ownership is not always equivalent to control. For example, where land is leased to another entity or individual to cultivate (e.g., a third-party manager), land is only directly controlled if the lease is accompanied by exhaustive criteria for land use. Such land-use criteria are often included in management plans and legal agreements that also incorporate sustainability principles and typically include termination provisions in the event of poor performance. To the extent that the third-party manager must make minimal, ad-hoc, and discretionary land-use decisions that fall outside the scope of the land-use criteria, the land may still be considered directly controlled by the organization. This metric includes crops cultivated through low-till and no-till methods.
defined by: giin

Permanent Employee Wages: People with Disabilities
type: Concept
type: Code
has name: Permanent Employee Wages: People with Disabilities
has description: Value of wages (including bonuses, excluding benefits) paid to all full- and part-time employees of the organization with disabilities during the reporting period.
definition: Value of wages (including bonuses, excluding benefits) paid to all full- and part-time employees of the organization with disabilities during the reporting period.
has identifier: OI1682
notation: OI1682
had primary source: OI1682
note: Organizations should footnote all assumptions used, as well as any specific focus on stakeholders with particular disabilities.
scope note: This metric is intended to capture pre-tax wages and salaries paid to the organization’s full- and part-time employees with disabilities and should include neither benefits nor payroll expenses. This metric should exclude Temporary Employee Wages (OI4202).
defined by: giin

Water Consumed: Total
type: Concept
type: Code
has name: Water Consumed: Total
has description: Volume of water used for the organization's operations during the reporting period.
definition: Volume of water used for the organization's operations during the reporting period.
has identifier: OI1697
notation: OI1697
had primary source: OI1697
note: Organizations should footnote all assumptions used.
scope note: This metric is intended to capture the volume of water used within the organization for any purpose, including but not limited to productive processes (for example, packaging and manufacturing), human consumption, and agricultural purposes. This metric, as well as other metrics calculated using Water Withdrawn (OI0263) and Water Discharged (OI0386), can be used in conjunction with Water Type (OD7536) to describe water consumption in more detail. For further guidance on water uses, see the Alliance for Water Efficiency (http://www.allianceforwaterefficiency.org). In some contexts, this metric can serve as an indicator of whether the outcome being sought by an investor or organization is occurring (the WHAT dimension of impact). For more on the alignment of IRIS metrics to the five dimensions of impact, see IRIS+ and the Five Dimensions of Impact (https://iris.thegiin.org/document/iris-and-the-five-dimensions/). No single metric is sufficient to understand an impact; rather, metrics are selected as a set across all dimensions of impact. When possible, the selection of metrics to measure and describe the five dimensions should be based on best practice and evidence.
defined by: giin

Records System
type: Concept
type: Code
has name: Records System
has description: Describes the system used by a facility or service for record keeping, including whether it is paper-based or electronic, as of the end of the reporting period.
definition: Describes the system used by a facility or service for record keeping, including whether it is paper-based or electronic, as of the end of the reporting period.
has identifier: OI1804
notation: OI1804
had primary source: OI1804
note: Organization should footnote the details on the records system, including whether information stored is shared with target stakeholders themselves.
scope note: This metric is intended to capture details of the organization’s record-keeping system. This metric may track health records systems, as well as records systems in other contexts. In health, and in other fields, organizations are encouraged to allow patients or clients to access information collected about them.
defined by: giin

Gender Wage Equity
type: Concept
type: Code
has name: Gender Wage Equity
has description: Ratio of the average wage paid during the reporting period to female employees of the organization for a specified position compared to the average wage paid during the reporting period to male employees of the organization for the same position.
definition: Ratio of the average wage paid during the reporting period to female employees of the organization for a specified position compared to the average wage paid during the reporting period to male employees of the organization for the same position.
has identifier: OI1855
notation: OI1855
had primary source: OI1855
note: Organizations should footnote all assumptions used, including details about the position used in the calculation. See usage guidance for further information.
scope note: This metric is intended to estimate gender wage equity at an organization. If women and men are paid the same average wage for the same position, the ratio would be 1. This ratio can be calculated based on salaried employees with fixed wages or on employees with variable salaries (such as hourly, daily, weekly, other specified time cycle, or other specified parameter). Organizations should footnote the specific position used in calculating this ratio, including whether the position is a managerial or non-managerial role. Organizations reporting this metric for multiple positions are encouraged to report these various data points for gender wage equity and to specify the position to which each data point corresponds. While this metric helps organizations begin to understand gender wage equity in their operations, organizations are cautioned that other factors may affect the data collected. For example, the average wages reported for this metric may only be meaningful if multiple individuals of both genders have a similar position within the organization. Employee education, experience, and tenure at the organization, among other factors, may also influence wage disparities. In specific contexts, and based on evidence, this metric may serve as a proxy indicator of whether the outcome being sought by an investor or organization is occurring (the WHAT dimension of impact). For more on the alignment of IRIS metrics to the five dimensions of impact, see IRIS+ and the Five Dimensions of Impact (https://iris.thegiin.org/document/iris-and-the-five-dimensions/). No single metric is sufficient to understand an impact; rather, metrics are selected as a set across all dimensions of impact. When possible, the selection of metrics to measure and describe the five dimensions should be based on best practice and evidence.
defined by: giin

Part-time Employees: Hired
type: Concept
type: Code
has name: Part-time Employees: Hired
has description: Number of paid, part-time employees hired by the organization during the reporting period.
definition: Number of paid, part-time employees hired by the organization during the reporting period.
has identifier: OI1903
notation: OI1903
had primary source: OI1903
note: Organizations should footnote all assumptions used.
scope note: This metric is intended to capture the number of unique individuals hired by the organization into part-time roles over the course of the last reporting period. This metric excludes Temporary Employees (OI9028). This metric is multi-dimensional with regard to the five dimensions of impact: it may help describe the WHO dimension when the stakeholder group represented by the metric is the stakeholder group targeted by the investment or organization. It may also help measure the HOW MUCH Scale dimension, which helps estimate the number of the targeted stakeholders experiencing the outcome. For more on the alignment of IRIS metrics to the five dimensions of impact, see IRIS+ and the Five Dimensions of Impact (https://iris.thegiin.org/document/iris-and-the-five-dimensions/). No single metric is sufficient to understand an impact; rather, metrics are selected as a set across all dimensions of impact. When possible, the selection of metrics to measure and describe the five dimensions should be based on best practice and evidence.
defined by: giin

Water Consumed: Recycled
type: Concept
type: Code
has name: Water Consumed: Recycled
has description: Volume of recycled water used for the organization's operations during the reporting period.
definition: Volume of recycled water used for the organization's operations during the reporting period.
has identifier: OI1927
notation: OI1927
had primary source: OI1927
note: Organizations should footnote all assumptions used.
scope note: This metric is intended to capture the volume of recycled water used within the organization for any purpose, including but not limited to productive processes (for example, packaging and manufacturing), human consumption, and agricultural purposes. This metric, as well as other metrics calculated using Water Withdrawn (OI0263) and Water Discharged (OI0386), can be used in conjunction with Water Type (OD7536) to describe water consumption in more detail. For further guidance on water uses, see the Alliance for Water Efficiency (http://www.allianceforwaterefficiency.org). In some contexts, this metric can serve as an indicator of whether the outcome being sought by an investor or organization is occurring (the WHAT dimension of impact). For more on the alignment of IRIS metrics to the five dimensions of impact, see IRIS+ and the Five Dimensions of Impact (https://iris.thegiin.org/document/iris-and-the-five-dimensions/). No single metric is sufficient to understand an impact; rather, metrics are selected as a set across all dimensions of impact. When possible, the selection of metrics to measure and describe the five dimensions should be based on best practice and evidence.
defined by: giin

Social and Environmental Board Committee
type: Concept
type: Code
has name: Social and Environmental Board Committee
has description: Indicates whether the organization has a formal board of directors or governing body committee dedicated to social and environmental performance.
definition: Indicates whether the organization has a formal board of directors or governing body committee dedicated to social and environmental performance.
has identifier: OI1984
notation: OI1984
had primary source: OI1984
note: Organizations should footnote relevant details about the responsibilities of the social and/or environmental committee.
scope note: This metric is intended to capture whether a committee on the organization’s board of directors oversees social and environmental performance. A board of directors is a group of individuals legally responsible to govern a corporation and responsible to the shareholders and other relevant stakeholders. A governing body with a different name (e.g., "advisory body") may be considered a Board of Directors provided it has a fiduciary and/or social responsibility to shareholders and/or other relevant stakeholders.
defined by: giin

Full-time Employees: People with Disabilities
type: Concept
type: Code
has name: Full-time Employees: People with Disabilities
has description: Number of paid, full-time employees at the organization with disabilities as of the end of the reporting period.
definition: Number of paid, full-time employees at the organization with disabilities as of the end of the reporting period.
has identifier: OI2003
notation: OI2003
had primary source: OI2003
note: Organizations should footnote all assumptions used, as well as any specific focus on stakeholders with particular disabilities.
scope note: This metric is intended to capture the number of unique individuals with disabilities employed by the organization in full-time roles as of the end of the reporting period. This metric excludes Temporary Employees (OI9028). This metric is multi-dimensional with regard to the five dimensions of impact: it may help describe the WHO dimension when the stakeholder group represented by the metric is the stakeholder group targeted by the investment or organization. It may also help measure the HOW MUCH Scale dimension, which helps estimate the number of the targeted stakeholders experiencing the outcome. For more on the alignment of IRIS metrics to the five dimensions of impact, see IRIS+ and the Five Dimensions of Impact (https://iris.thegiin.org/document/iris-and-the-five-dimensions/). No single metric is sufficient to understand an impact; rather, metrics are selected as a set across all dimensions of impact. When possible, the selection of metrics to measure and describe the five dimensions should be based on best practice and evidence.
defined by: giin

Climate Resilience Strategy
type: Concept
type: Code
has name: Climate Resilience Strategy
has description: Indicates whether the organization implements a strategy to address the effects of climate change on the organization's operations.
definition: Indicates whether the organization implements a strategy to address the effects of climate change on the organization's operations.
has identifier: OI2092
notation: OI2092
had primary source: OI2092
note: Organizations should footnote the details of the strategy, how it is being implemented, and how climate resilience is incorporated into risk models. See usage guidance for further information.
scope note: This metric is intended to capture detailed information on a climate resilience strategy in place but does not provide an evaluation of the success with which that strategy is implemented. A Climate Resilience Strategy contains procedures in response to the acknowledgment that climate change may affect the organization's operations, as compared to procedures that describe the organization's effects on climate change. (For the latter, see Greenhouse Gas Emissions Strategy [OI8237]). A Climate Resilience Strategy may include risk management procedures to handle the implications of natural hazards such as fire, wind, water, pest, and disease, as well as adaptation strategies to manage other impacts of climate change.
defined by: giin

Number of Legal and Regulatory Complaints
type: Concept
type: Code
has name: Number of Legal and Regulatory Complaints
has description: Number of formal legal and regulatory complaints received by the organization during the last reporting period.
definition: Number of formal legal and regulatory complaints received by the organization during the last reporting period.
has identifier: OI2165
notation: OI2165
had primary source: OI2165
note: Organizations should footnote details on the nature of these complaints, how they were identified, the number of complaints that were substantiated, and any corrective actions that were taken to ameliorate them and prevent them from happening in the future. See usage guidance for further information.
scope note: This metric is intended to capture the number of formal complaints directed to the organization during the reporting period. A formal legal or regulatory complaint includes any complaint levied against the organization by an individual, other organization, or government body due to the organization's violations of rules of any government, regulatory organization, licensing agency, or professional association governing their professional activities and any resulting externalities. Depending on the category in which the organization operates, formal legal and regulatory complaints could be associated with (but not limited to) any of the following: -Bribery or corruption, including violations of the US Foreign Corrupt Practices Act (FCPA) or UK Bribery Act -Data security breaches -Diversity and equal opportunity -Cartel activities, price fixing, or anti-trust activities -Consumer privacy -Environmental violations -Employee safety or workplace conditions -False, deceptive, or unfair advertising -False marketing claims -Federal pipeline and storage regulations -Financial reporting inaccuracies -Labor law violations -Land rights disputes -Libel or slander -Money laundering -Tax evasion Organizations may already report this information elsewhere, such as in their regular financial statements. Additionally, many Ombuds offices, either governmental or organization-specific, collect information regarding complaints. Organizations should consider reporting this metric in conjunction with Value of Fines and Settlements (OI7639).
defined by: giin

Founders: Total
type: Concept
type: Code
has name: Founders: Total
has description: Number of the organization's founders who retain an active role in the company as of the end of the reporting period.
definition: Number of the organization's founders who retain an active role in the company as of the end of the reporting period.
has identifier: OI2209
notation: OI2209
had primary source: OI2209
note: Organizations should footnote all assumptions used.
scope note: This metric is intended to capture the number of founders with an active role in the organization. An active role may include acting in an advisory capacity for key decisions. It need not necessarily require a full-time role at the organization. This metric is multi-dimensional with regard to the five dimensions of impact. It may help describe the WHO dimension when the stakeholder group represented by the metric is the stakeholder group targeted by the investment or organization. It may also help measure the HOW MUCH Scale dimension, which helps estimate the number of the targeted stakeholders experiencing the outcome. For more on the alignment of IRIS metrics to the five dimensions of impact, see IRIS+ and the Five Dimensions of Impact (https://iris.thegiin.org/document/iris-and-the-five-dimensions/). No single metric is sufficient to understand an impact; rather, metrics are selected as a set across all dimensions of impact. When possible, the selection of metrics to measure and describe the five dimensions should be based on best practice and evidence.
defined by: giin

Average Employee Tenure
type: Concept
type: Code
has name: Average Employee Tenure
has description: Average tenure of employees of the organization as of the end of the reporting period.
definition: Average tenure of employees of the organization as of the end of the reporting period.
has identifier: OI2248
notation: OI2248
had primary source: OI2248
note: Organizations should footnote all assumptions used. See usage guidance for further information.
scope note: This metric is intended to capture the average length of time individuals in permanent employment are employed by the organization. Organizations should exclude Temporary Employees (OI9028) from this calculation. To calculate tenure, subtract an employee’s (employment) start date from the earlier of the end date of the reporting period or their termination date during the reporting period. Sum the total number of days across all employees and then average as shown in the calculation. Where applicable, footnote the type of date used as an employment start date in the tenure calculation, such as “immediately upon employment” or “upon satisfactory completion of a probationary period.” In addition to calculation assumptions, organizations are encouraged to footnote any narrative regarding average employee tenure. In some contexts, this metric can be used to measure the duration that a specific outcome lasts for. In those cases, this metric may serve as an indicator for the HOW MUCH Duration dimension of impact. For more on the alignment of IRIS metrics to the five dimensions of impact, see IRIS+ and the Five Dimensions of Impact (https://iris.thegiin.org/document/iris-and-the-five-dimensions/). No single metric is sufficient to understand an impact; rather, metrics are selected as a set across all dimensions of impact. When possible, the selection of metrics to measure and describe the five dimensions should be based on best practice and evidence.
defined by: giin

Community Engagement Strategy
type: Concept
type: Code
has name: Community Engagement Strategy
has description: Indicates whether the organization implements a strategy to manage its interactions with local communities that are affected by its operations.
definition: Indicates whether the organization implements a strategy to manage its interactions with local communities that are affected by its operations.
has identifier: OI2319
notation: OI2319
had primary source: OI2319
note: Organizations should footnote relevant details about their community engagement strategy and how it is being implemented. See usage guidance for further information.
scope note: This metric is intended to capture whether the organization has a strategy to engage with its local stakeholder communities. Community engagement strategies involve intentional approaches to align the development priorities of local communities with the goals of the organization. Examples of strategy elements, to footnote, may include: providing deliberate resources (e.g., employee time and skills, in-kind giving, leadership) to community organizations or individuals, providing education and skills training, creating opportunities for employee volunteering and fundraising, contracting to local suppliers, lobbying to strengthen local issues, facilitating discussions with local leaders, integrating the company's community engagement activities into organizational functions, creating institutional policies and incentives for community engagement, and measuring the social impact of the organization's community engagement activities. The strategy may also dictate methods (e.g., memoranda of understanding) for considering, informing, and consulting with existing community groups before implementing organizational activities that affect the community. For example, organizations may assess and take into account existing formal, informal, and historic land-use rights of local communities or Indigenous peoples prior to operations that affect the land. Historical land titles offer one way to evaluate which communities to engage. LandMark (http://www.landmarkmap.org/) provides data on Indigenous and community land rights. In engaging the community, organizations should use a consent process to ensure that the entire community endorses the project and not just a few elite members. Biodiversity conservation projects will often require involving traditional landowners or others from the community who rely on the land. Organizations can refer to the following sources for further guidance on community engagement strategies: - Community Planning Toolkit (http://www.communityplanningt…
defined by: giin

Governance Policies
type: Concept
type: Code
has name: Governance Policies
has description: Indicates whether the organization has written corporate governance policies that have been communicated to stakeholders.
definition: Indicates whether the organization has written corporate governance policies that have been communicated to stakeholders.
has identifier: OI2330
notation: OI2330
had primary source: OI2330
note: Organizations should footnote relevant details about their corporate governance policies and how they are communicated and enforced.
scope note: This metric is intended to capture detailed information on the governance policies in place, but it does not evaluate these policies. Corporate governance is the system by which corporations (whether businesses or nonprofit) are directed and controlled. The corporate governance structure specifies the distribution of rights and responsibilities among different participants in the corporation such as the boards, managers, shareholders, and other stakeholders, and it spells out the rules and procedures for making decisions on corporate affairs. By doing this, it also provides the structure through which the organization's objectives are set, as well as the means of attaining those objectives and monitoring performance.
defined by: giin

Historically Marginalized Wage Equity
type: Concept
type: Code
has name: Historically Marginalized Wage Equity
has description: Ratio of the average wage paid for a specified position to employees of the organization who belong to groups historically marginalized on the basis of race and/or ethnicity compared to the average wage paid to employees of the organization who do not belong to these groups but have the same position during the reporting period.
definition: Ratio of the average wage paid for a specified position to employees of the organization who belong to groups historically marginalized on the basis of race and/or ethnicity compared to the average wage paid to employees of the organization who do not belong to these groups but have the same position during the reporting period.
has identifier: OI2362
notation: OI2362
had primary source: OI2362
note: Organizations should footnote all assumptions used, including details about the position used in the calculation. See usage guidance for further information.
scope note: This metric is intended to capture the disparity—if any—between employees from groups historically marginalized on the basis of race and/or ethnicity compared to other employees who are not from groups historically marginalized on the basis of race and/or ethnicity. If the average wages paid to both groups on average were the same, the ratio would be 1. Organizations should use Target Stakeholder Demographic (PD5752) to disaggregate these groups. This ratio can be calculated based on salaried employees with fixed wages or on employees with variable salaries (such as hourly, daily, weekly, other specified time cycle, or other specified parameter). Organizations should footnote the specific position used in calculating this ratio, including whether the position is a managerial or non-managerial role. Organizations reporting this metric for multiple positions are encouraged to report these various data points for historically marginalized wage equity and to specify the position to which each data point corresponds. While this metric helps organizations begin to understand historically marginalized wage equity in their operations, organizations are cautioned that other factors may affect the data collected. For example, the average wages reported for this metric may only be meaningful if multiple individuals both within and without groups historically marginalized on the basis of race and/or ethnicity have similar positions within the organization. Employee education, experience, and tenure at the organization, among other factors, may also influence wage disparities. This metric is multidimensional with regard to the five dimensions of impact. In some contexts, this metric can serve as an indicator of whether the outcome being sought by an investor or organization is occurring (the WHAT dimension of impact). This metric may also help describe the HOW MUCH Scale dimension, which helps estimate the number of the targeted stakeholders experiencing the outcome. For more on…
defined by: giin

Value of Carbon Credits Purchased
type: Concept
type: Code
has name: Value of Carbon Credits Purchased
has description: Value of carbon credits purchased by the organization during the reporting period.
definition: Value of carbon credits purchased by the organization during the reporting period.
has identifier: OI2436
notation: OI2436
had primary source: OI2436
note: Organizations should footnote relevant details on the carbon credits purchased. See usage guidance for further information.
scope note: This metric is intended to capture the equivalent monetary value of the carbon credits purchased during the reporting period. Organizations are encouraged to report this metric in conjunction with Greenhouse Gas Emissions Avoided Due to Carbon Offsets Purchased (OI6774). Examples of relevant details to footnote include whether the carbon offset was purchased through an offset market or through a specific offset project. If the carbon offset was purchased in an offset market, additional relevant details to footnote include information on the carbon offset market in which the organization purchased the credit(s), whether the carbon market is a compliance or voluntary market, and the unique identification number and third-party registry for the purchased carbon credit(s). If the carbon offset is purchased through a specific offset project, additional relevant details to footnote include what baseline was used for the calculation, evidence that the project would not have been undertaken without carbon offset expenditures, and whether the funds were directed towards the project's capital expenditures or other uses (e.g., maintenance). Organizations can refer to the glossary for additional information on carbon credits. In some contexts, this metric can serve as an indicator of whether the outcome being sought by an investor or organization is occurring (the WHAT dimension of impact). For more on the alignment of IRIS metrics to the five dimensions of impact, see IRIS+ and the Five Dimensions of Impact (https://iris.thegiin.org/document/iris-and-the-five-dimensions/). No single metric is sufficient to understand an impact; rather, metrics are selected as a set across all dimensions of impact. When possible, the selection of metrics to measure and describe the five dimensions should be based on best practice and evidence.
defined by: giin

Permanent Employees: Female
type: Concept
type: Code
has name: Permanent Employees: Female
has description: Number of women in paid employment with the organization as of the end of the reporting period, whether they are full-time or part-time.
definition: Number of women in paid employment with the organization as of the end of the reporting period, whether they are full-time or part-time.
has identifier: OI2444
notation: OI2444
had primary source: OI2444
note: Organizations should footnote all assumptions used.
scope note: This metric is intended to capture the number of unique women employed by the organization in full- or part-time roles as of the end of the reporting period. This metric excludes Temporary Employees (OI9028). This metric is multi-dimensional with regard to the five dimensions of impact: it may help describe the WHO dimension when the stakeholder group represented by the metric is the stakeholder group targeted by the investment or organization. It may also help measure the HOW MUCH Scale dimension, which helps estimate the number of the targeted stakeholders experiencing the outcome. For more on the alignment of IRIS metrics to the five dimensions of impact, see IRIS+ and the Five Dimensions of Impact (https://iris.thegiin.org/document/iris-and-the-five-dimensions/). No single metric is sufficient to understand an impact; rather, metrics are selected as a set across all dimensions of impact. When possible, the selection of metrics to measure and describe the five dimensions should be based on best practice and evidence.
defined by: giin

Energy Generated for Use: Renewable
type: Concept
type: Code
has name: Energy Generated for Use: Renewable
has description: Amount of energy both generated and consumed by the organization from renewable sources during the reporting period.
definition: Amount of energy both generated and consumed by the organization from renewable sources during the reporting period.
has identifier: OI2496
notation: OI2496
had primary source: OI2496
note: Organizations should footnote all assumptions used.
scope note: NOTE: This metric will be deprecated in a forthcoming update to the IRIS Catalog of Metrics. users are advised to instead report Energy Generated for Use: Total (OI9624), disaggregated by Primary Energy Source (OI3781), all options under Renewable. This metric is intended to capture the amount of renewable energy both produced and used by the organization. For example, if an organization installed solar panels at its factory, it would report the amount of energy produced and used from those panels. Renewable energy sources include solar, wind, geothermal, hydro energy, and biomass, among other forms. Organizations can refer to the glossary for additional information. Large-scale hydropower is often excluded from the definition of renewable energy. Although water itself is a renewable resource, the natural ecology of rivers is not, and hydroelectric dams can adversely affect aquatic ecosystems. Organizations can refer to the Low Impact Hydropower Institute (<http://lowimpacthydro.org>) for further guidance on creating low-impact hydropower operations. In some contexts, this metric can serve as an indicator of whether the outcome being sought by an investor or organization is occurring (the WHAT dimension of impact). For more on the alignment of IRIS metrics to the five dimensions of impact, see IRIS+ and the Five Dimensions of Impact (https://iris.thegiin.org/document/iris-and-the-five-dimensions/). No single metric is sufficient to understand an impact; rather, metrics are selected as a set across all dimensions of impact. When possible, the selection of metrics to measure and describe the five dimensions should be based on best practice and evidence.
defined by: giin

Waste Disposed: Recycled/Reused
type: Concept
type: Code
has name: Waste Disposed: Recycled/Reused
has description: Amount of waste disposed by the organization through reuse and recycling during the reporting period.
definition: Amount of waste disposed by the organization through reuse and recycling during the reporting period.
has identifier: OI2535
notation: OI2535
had primary source: OI2535
note: Organizations should footnote all assumptions used.
scope note: This metric is intended to capture the amount of waste from the organization that is recycled or reused during the reporting period. In some contexts, this metric can serve as an indicator of whether the outcome being sought by an investor or organization is occurring (the WHAT dimension of impact). For more on the alignment of IRIS metrics to the five dimensions of impact, see IRIS+ and the Five Dimensions of Impact (https://iris.thegiin.org/document/iris-and-the-five-dimensions/). No single metric is sufficient to understand an impact; rather, metrics are selected as a set across all dimensions of impact. When possible, the selection of metrics to measure and describe the five dimensions should be based on best practice and evidence.
defined by: giin

Land Directly Controlled: Treated with Pesticides
type: Concept
type: Code
has name: Land Directly Controlled: Treated with Pesticides
has description: Area of land directly controlled by the organization and treated with pesticides. Report directly controlled land area treated during the reporting period.
definition: Area of land directly controlled by the organization and treated with pesticides. Report directly controlled land area treated during the reporting period.
has identifier: OI2569
notation: OI2569
had primary source: OI2569
note: Organizations should footnote details on the area of land directly controlled, disaggregated by the hazard level of pesticides used, as listed by the World Health Organization’s (WHO) Acute Toxicity Hazard Categories. Organizations should also footnote the source of data. See glossary term and usage guidance for further information.
scope note: The IRIS catalog differentiates between land that the organization directly controls and land that the organization indirectly controls. This metric is intended to capture the area of land that is under the organization's direct control and that is treated with pesticides. Organizations can refer to the glossary for additional information on pesticide use and the WHO’s Acute Toxicity Hazard Categories. Organizations that use WHO Class Ia (extremely hazardous) and Ib (highly hazardous) pesticides on directly controlled land should footnote additional details on the relevant land (for example, area applied and crops present) and pesticide use. Direct control refers to land for which the organization controls land use through direct operation or management, including situations in which the organization's employees cultivate the land directly. Note that land ownership is not always equivalent to control. For example, where land is leased to another entity or individual to cultivate (e.g., a third-party manager), land is only directly controlled if the lease is accompanied by exhaustive criteria for land use. Such land-use criteria are often included in management plans and legal agreements that also incorporate sustainability principles and typically include termination provisions in the event of poor performance. To the extent that the third-party manager must make minimal, ad-hoc, and discretionary land-use decisions that fall outside the scope of the land-use criteria, the land may still be considered directly controlled by the organization.
defined by: giin

Conflict of Interest Policy
type: Concept
type: Code
has name: Conflict of Interest Policy
has description: Indicates whether the organization has a written policy to monitor and disclose any potential conflicts of interest between the organization and its board members, owners, or material investors.
definition: Indicates whether the organization has a written policy to monitor and disclose any potential conflicts of interest between the organization and its board members, owners, or material investors.
has identifier: OI2596
notation: OI2596
had primary source: OI2596
note: Organizations should footnote the details of this policy and information about conflicts of interest disclosed during the reporting period.
scope note: This metric is intended to capture the organization’s policies on conflicts of interest. A conflict of interest is a set of circumstances that creates a risk that professional judgment or actions regarding a primary interest will be unduly influenced by a secondary interest.
defined by: giin

Forest Management Plan
type: Concept
type: Code
has name: Forest Management Plan
has description: Indicates whether the organization implements a forest management plan.
definition: Indicates whether the organization implements a forest management plan.
has identifier: OI2622
notation: OI2622
had primary source: OI2622
note: Organizations should footnote the relevant details about their forest management plan. See usage guidance for further information.
scope note: This metric is intended to capture whether an organization has a forest management plan (FMP), which delineates the technical application of appropriate forestry principles, practices, and business techniques to manage a forest in pursuit of the landowner's objectives. Organizations' FMPs typically include information about land tenure, existing designation and land use, landowners' goals and objectives, location (including limits and bounds), protection and maintenance activities, inventory data, and proscribed activities. FMPs also typically outline a Measurement, Reporting, and Verification (MRV) system that collects and monitors such data as the yield of forest products harvested; the growth rates, regeneration, and condition of the forest; the composition and observed changes in the resident flora and fauna; the environmental and social impacts of harvesting and other operations; and the costs, productivity, and efficiency of forest management. FMPs may also include a requirement to conduct an Environmental & Social Impact Assessment (ESIA) to assess, for example, High Conservation Value (HCV) and High Carbon Stock (HCS) forests. Examples of FMP details, to footnote, may include: what information is included in the FMP, whether the plan has been approved by national authorities, whether the organization regularly submits its reports to the relevant national authorities, whether the organization has a team in charge of its implementation, whether the plan is applied as a guide in annual harvesting or collecting operations, whether the plan is reviewed regularly (and at what interval), and whether the plan’s implementation is verified by a third party. Organizations are encouraged, where applicable, to report this metric in conjunction with Land Directly Controlled: Sustainably Managed (OI6912) and Land Indirectly Controlled: Sustainably Managed (PI6796). Organizations can refer to the following resources for additional guidance: - International Finance Corporati…
defined by: giin

Employment Benefits
type: Concept
type: Code
has name: Employment Benefits
has identifier: OI2742
notation: OI2742
had primary source: OI2742
note: Organizations should footnote eligibility requirements for different types of benefits and the number of employees who enroll in each benefit offering. See usage guidance for further information.
scope note: This metric is intended to capture the benefits provided to employees of the organization. Organizations may select from the list provided. Organizations are also encouraged to capture employee participation in each benefit using Employment Benefits Uptake (OI8865), which can be helpful in identifying which benefits are accessible and which are too costly for employees to use. Benefits mentioned may be offered either directly by the organization or by regional governmental programs in the region of operations. Examples of types of benefits to footnote are included below. Typical benefits provided to employees include health insurance, dental insurance, disability coverage, life insurance, maternity/paternity leave, paid time off, retirement provisions, and stock ownership, among others. Some organizations also offer supplementary benefits, which organizations are encouraged to report if they provide. These may include onsite childcare, offsite subsidized childcare, counseling services, and education subsidies, among others. Organizations may choose to report this metric in conjunction with related metrics giving contextual information, such as Healthcare Benefits Premium Covered (OI1503). Examples of additional details to footnote include: which of these benefits, if any, are provided to full-time employees with a minimum tenure at the organization versus which are provided to all full-time employees; which of these benefits, if any, are provided to salaried versus non-salaried employees; and other relevant details about eligibility requirements.
has description: Describes the benefits that are provided to full-time employees of the organization during the reporting period. Select all that apply: - Health insurance - Dental insurance - Unemployment insurance - Disability coverage/insurance - Life insurance - Paid time off: Maternity/birth parent leave - Paid time off: Paternity/supporting parent leave - Paid time off: Vacation/holiday - Paid time off: Sick leave - Flexible work arrangements - Childcare support (on-site, vouchers, or reimbursement) - Transportation support (provided by company, vouchers, or reimbursement) - Retirement provisions - Stock ownership - Profit-sharing - Other (please describe)
definition: Describes the benefits that are provided to full-time employees of the organization during the reporting period. Select all that apply: - Health insurance - Dental insurance - Unemployment insurance - Disability coverage/insurance - Life insurance - Paid time off: Maternity/birth parent leave - Paid time off: Paternity/supporting parent leave - Paid time off: Vacation/holiday - Paid time off: Sick leave - Flexible work arrangements - Childcare support (on-site, vouchers, or reimbursement) - Transportation support (provided by company, vouchers, or reimbursement) - Retirement provisions - Stock ownership - Profit-sharing - Other (please describe)
defined by: giin

Protected Area Connectedness Assessment
type: Concept
type: Code
has name: Protected Area Connectedness Assessment
has description: Describes whether the organization has evaluated the continuity of natural habitats in protected areas as of the end of the reporting period.
definition: Describes whether the organization has evaluated the continuity of natural habitats in protected areas as of the end of the reporting period.
has identifier: OI2767
notation: OI2767
had primary source: OI2767
note: Organizations should footnote all assumptions used, including source(s) of data.
scope note: This metric is intended to capture where the organization has assessed the connectedness of protected areas, which is an important measure of habitat available to flora and fauna. To assess the connectedness of a land area, organizations can implement the use of a geographic information system or apply an existing resource, such as the Protected Area Connectedness Index (https://dashboard.natureserve.org/metadata/paconnectednessindex). This indicator is used by the Convention on Biological Diversity’s Aichi Target 11, which aims to improve biodiversity by safeguarding ecosystems, species, and genetic diversity. Aichi Target 11 relates to other UN conventions, such as SDG 15 and the Intergovernmental Science-Policy Platform on Biodiversity and Ecosystem Services. More information on this indicator can be found through the Biodiversity Indicators Partnership, which uses remote satellite imagery to visualize forest change and land cover compared to global protected areas.
defined by: giin

Level of Water Stress
type: Concept
type: Code
has name: Level of Water Stress
has identifier: OI2799
notation: OI2799
had primary source: OI2799
note: Organizations should footnote all assumptions used, including which tools or methodologies were used to assess the level of water stress.
scope note: This metric is intended to capture the level of baseline water stress on land managed by the organization. Climate change and water scarcity are inextricably linked and self-reinforcing. Biodiversity and much of the global population face water shortages due to drying out of habitats, leading to drinking water shortages, salinization, and failed harvests. Knowledge of water stress levels can guide organizations’ design and focus of sustainable water management plans, including irrigation methods, urban planning, and wastewater reuse. Organizations may use tools such as the Water Resources Institute's Aqueduct Water Risk Atlas (https://www.wri.org/aqueduct) or WWF–DEG's Water Risk Filter (http://waterriskfilter.panda.org/) to find data on and describe water stress on directly or indirectly managed land. Remote sensing data are also a valuable source of information on water stress and its impact on ecosystems anywhere in the world; such data are often available at small spatial scale, if needed. This metric may help describe the WHO dimension of impact, which details which stakeholders the investment or enterprise aims to reach with the outcome. This metric may also help clarify how underserved they were prior to the investment. For more on the alignment of IRIS metrics to the five dimensions of impact, refer to the IRIS+ guidance document: IRIS+ and the Five Dimensions of Impact. No single metric is sufficient to understand an impact; rather, metrics are selected as a set across all dimensions of impact. When possible, the selection of metrics to measure and describe the five dimensions should be based on best practice and evidence.
has description: Level of baseline water stress on land directly or indirectly managed by the organization as of the end of the reporting period. Choose all that apply: - Low (<10%) - Low-medium (10–19.9%) - Medium-high (20–39.9%) - High (40–80%) - Extremely high (>80%) - Arid and low water use - No data
definition: Level of baseline water stress on land directly or indirectly managed by the organization as of the end of the reporting period. Choose all that apply: - Low (<10%) - Low-medium (10–19.9%) - Medium-high (20–39.9%) - High (40–80%) - Extremely high (>80%) - Arid and low water use - No data
defined by: giin

Loan Officers Employed
type: Concept
type: Code
has name: Loan Officers Employed
has description: Number of loan officers employed by the organization as of the end of the reporting period.
definition: Number of loan officers employed by the organization as of the end of the reporting period.
has identifier: OI2818
notation: OI2818
had primary source: OI2818
scope note: This metric is intended to capture the number of loan officers employed by the organization. For organizations providing insurance products, this metric should also include insurance agents. This metric is multi-dimensional with regard to the five dimensions of impact. It may help describe the WHO dimension when the stakeholder group represented by the metric is the stakeholder group targeted by the investment or organization. It may also help measure the HOW MUCH Scale dimension, which helps estimate the number of the targeted stakeholders experiencing the outcome. For more on the alignment of IRIS metrics to the five dimensions of impact, see IRIS+ and the Five Dimensions of Impact (https://iris.thegiin.org/document/iris-and-the-five-dimensions/). No single metric is sufficient to understand an impact; rather, metrics are selected as a set across all dimensions of impact. When possible, the selection of metrics to measure and describe the five dimensions should be based on best practice and evidence.
defined by: giin

Percent Female/Gender Non-Binary Ownership
type: Concept
type: Code
has name: Percent Female/Gender Non-Binary Ownership
has description: Percentage of the organization that is owned by female or non-binary individuals as of the end of the reporting period.
definition: Percentage of the organization that is owned by female or non-binary individuals as of the end of the reporting period.
has identifier: OI2840
notation: OI2840
had primary source: OI2840
note: This metric is intended to capture the percentage of company shares that are owned by women or gender non-binary individuals. Where regional or local laws apply for calculating ownership by historically marginalized groups (including women and gender non-binary individuals), reporting should be consistent with these laws. Where laws do not exist, shares that are publicly traded or owned by institutions cannot contribute to the number of female- or gender non-binary-owned shares.
scope note: This metric is intended to capture the percentage of company shares that are owned by women. Where regional or local laws apply for calculating ownership by previously excluded groups (including women), reporting should be consistent with these laws. Where laws do not exist, shares that are publicly traded or owned by institutions cannot contribute to the number of female-owned shares.
defined by: giin

Water Consumed: Municipal
type: Concept
type: Code
has name: Water Consumed: Municipal
has description: Volume of water drawn from municipal water sources used for the organization's operations during the reporting period.
definition: Volume of water drawn from municipal water sources used for the organization's operations during the reporting period.
has identifier: OI3031
notation: OI3031
had primary source: OI3031
note: Organizations should footnote all assumptions used.
scope note: This metric is intended to capture the volume of water from municipal water sources used within the organization for any purpose, including but not limited to productive processes (for example, packaging and manufacturing), human consumption, and agricultural purposes. This metric, as well as other metrics calculated using Water Withdrawn (OI0263) and Water Discharged (OI0386), can be used in conjunction with Water Type (OD7536) to describe water consumption in more detail. For further guidance on water uses, see the Alliance for Water Efficiency (http://www.allianceforwaterefficiency.org). In some contexts, this metric can serve as an indicator of whether the outcome being sought by an investor or organization is occurring (the WHAT dimension of impact). For more on the alignment of IRIS metrics to the five dimensions of impact, see IRIS+ and the Five Dimensions of Impact (https://iris.thegiin.org/document/iris-and-the-five-dimensions/). No single metric is sufficient to understand an impact; rather, metrics are selected as a set across all dimensions of impact. When possible, the selection of metrics to measure and describe the five dimensions should be based on best practice and evidence.
defined by: giin

Part-time Employee Hours Worked
type: Concept
type: Code
has name: Part-time Employee Hours Worked
has description: Number of paid hours worked by part-time employees of the organization during the reporting period.
definition: Number of paid hours worked by part-time employees of the organization during the reporting period.
has identifier: OI3098
notation: OI3098
had primary source: OI3098
note: Organizations should footnote all assumptions used.
scope note: This metric is intended to capture the number of hours worked by part-time employees over the course of the reporting period. Organizations should exclude from this metric the number of hours worked by temporary employees—for these hours, organizations should report on Temporary Employee Hours Worked (OI8408). Organizations are encouraged to report this metric in conjunction with Part-time Employees: Total (OI8864).
defined by: giin

Caregivers Employed: Responsive
type: Concept
type: Code
has name: Caregivers Employed: Responsive
has description: Number of caregivers who are responsive to children's needs and who are employed by the organization as of the end of the reporting period.
definition: Number of caregivers who are responsive to children's needs and who are employed by the organization as of the end of the reporting period.
has identifier: OI3115
notation: OI3115
had primary source: OI3115
note: Organizations should footnote details about the types of caregivers employed and how the organization measures responsiveness. See usage guidance for further information.
scope note: This metric is intended to capture the number of individuals who provide responsive early childhood care to children in preschools, daycare, or other settings. Examples of caregivers include preschool teachers and parents. Responsive care is the process of watching and tuning into a child’s cues, thinking about what they might mean, and then sensitively responding to those cues; for more, see Zero to Three (https://www.zerotothree.org/resources/212-responsive-care). Caregivers need not necessarily be certified or licensed. To assess responsiveness, organizations may use tools such as the Infant Toddler Responsive Caregiver Checklist (ITRCC) or the Healthy Families Parenting Inventory (HFPI). This metric is multi-dimensional with regard to the five dimensions of impact. It may help describe the WHO dimension when the stakeholder group represented by the metric is the stakeholder group targeted by the investment or organization. It may also help measure the HOW MUCH Scale dimension, which helps estimate the number of the targeted stakeholders experiencing the outcome. For more on the alignment of IRIS metrics to the five dimensions of impact, see IRIS+ and the Five Dimensions of Impact (https://iris.thegiin.org/document/iris-and-the-five-dimensions/). No single metric is sufficient to understand an impact; rather, metrics are selected as a set across all dimensions of impact. When possible, the selection of metrics to measure and describe the five dimensions should be based on best practice and evidence.
defined by: giin

Full-time Employees: Historically Marginalized Managers
type: Concept
type: Code
has name: Full-time Employees: Historically Marginalized Managers
has description: Number of paid, full-time management employees (managers) at the organization who belong to groups historically marginalized on the basis of race and/or ethnicity as of the end of the reporting period.
definition: Number of paid, full-time management employees (managers) at the organization who belong to groups historically marginalized on the basis of race and/or ethnicity as of the end of the reporting period.
has identifier: OI3140
notation: OI3140
had primary source: OI3140
note: Organizations should footnote how their organization defines management levels, as well as their categorization of historically marginalized groups. See usage guidance for further information.
scope note: This metric is intended to capture the number of unique, individual managers who belong to groups historically marginalized on the basis of race and/or ethnicity and who are employed by the organization in full-time roles as of the end of the reporting period. This metric excludes Temporary Employees (OI9028). Organizations can refer to the glossary for additional guidance on defining management. The composition of management varies with an organization’s stage and type, but managers are generally responsible for setting objectives (defining goals for the group and deciding what work must be done to meet those goals), organizing (dividing work into manageable activities and selecting the right people to accomplish them), motivating and communicating (creating a team out of individuals through decisions on pay, promotion, and communications), measuring (establishing targets and interpreting and analyzing performance), and developing people. The categorization of groups historically marginalized on the basis of race and/or ethnicity varies with location and context. With no internationally agreed-upon definition as to which groups constitute historically marginalized, if well-established local policies exist (as in South Africa, with the Broad Based Black Economic Empowerment [BBBEE] definition of historically marginalized, or in India, based on backward caste), organizations should refer to these local guidelines to identify groups historically marginalized on the basis of race and/or ethnicity. Otherwise, and wherever appropriate, organizations should provide additional detail regarding their tailored methodology for defining these groups. This metric is multi-dimensional with regard to the five dimensions of impact: it may help describe the WHO dimension when the stakeholder group represented by the metric is the stakeholder group targeted by the investment or organization. It may also help measure the HOW MUCH Scale dimension, which helps estimate the number of th…
defined by: giin

New Firms Entered
type: Concept
type: Code
has name: New Firms Entered
has description: Describes whether additional private sector firms entered the market in which the organization operates during the reporting period.
definition: Describes whether additional private sector firms entered the market in which the organization operates during the reporting period.
has identifier: OI3141
notation: OI3141
had primary source: OI3141
note: Organizations should footnote all assumptions used, including source(s) of data.
scope note: This metric is intended to capture whether (other) private sector firms entered the organization’s market during the reporting period. In some contexts, this metric measures increased competition that may be related to the organization’s success. However, the entry of new firms should not be attributed directly to the organization’s activities, nor can it be fully attributed to a specific intervention. Increased competition in a relevant market is often accompanied by an increase in product or service quality or a decrease in product or service price, though these trends alone do not always indicate an entry of new firms; in particular, these trends may also result from the reaction of existing players in relevant markets to new entrants or potential new entrants. However, the entry of new firms into a market is easier to measure than changes in the strategy or positioning of existing firms in that market. This metric applies only if the organization is expected to attract other firms to the same market and may be used alongside New Market Entry (OI3441) or Market Share Increased (OI4211). Data for this metric may be tracked annually (throughout a project cycle) or through an evaluation or survey. International Finance Institutions (IFIs) often use this metric as part of their analysis of private sector development.
defined by: giin

Full-time Employees: Total
type: Concept
type: Code
has name: Full-time Employees: Total
has description: Number of paid full-time employees at the organization as of the end of the reporting period.
definition: Number of paid full-time employees at the organization as of the end of the reporting period.
has identifier: OI3160
notation: OI3160
had primary source: OI3160
note: Organizations should footnote all assumptions used.
scope note: This metric is intended to capture the number of unique individuals employed by the organization in full-time roles as of the end of the reporting period. This metric excludes Temporary Employees (OI9028). This metric is multi-dimensional with regard to the five dimensions of impact: it may help describe the WHO dimension when the stakeholder group represented by the metric is the stakeholder group targeted by the investment or organization. It may also help measure the HOW MUCH Scale dimension, which helps estimate the number of the targeted stakeholders experiencing the outcome. For more on the alignment of IRIS metrics to the five dimensions of impact, see IRIS+ and the Five Dimensions of Impact (https://iris.thegiin.org/document/iris-and-the-five-dimensions/). No single metric is sufficient to understand an impact; rather, metrics are selected as a set across all dimensions of impact. When possible, the selection of metrics to measure and describe the five dimensions should be based on best practice and evidence.
defined by: giin

Permanent Employees: Historically Marginalized
type: Concept
type: Code
has name: Permanent Employees: Historically Marginalized
has description: Number of people in paid employment with the organization who belong to groups historically marginalized on the basis of race and/or ethnicity as of the end of the reporting period, whether they are full-time or part-time.
definition: Number of people in paid employment with the organization who belong to groups historically marginalized on the basis of race and/or ethnicity as of the end of the reporting period, whether they are full-time or part-time.
has identifier: OI3236
notation: OI3236
had primary source: OI3236
note: Organizations should footnote all assumptions used, including their categorization of historically marginalized groups. See usage guidance for further information.
scope note: This metric is intended to capture the number of unique individuals who belong to groups historically marginalized on the basis of race and/or ethnicity and who are employed by the organization in full- or part-time roles as of the end of the reporting period. This metric excludes Temporary Employees (OI9028). The categorization of historically marginalized groups varies with location and context. With no internationally agreed-upon definition as to which groups constitute historically marginalized on the basis of race and/or ethnicity, if well-established local policies exist (as in South Africa, with the Broad Based Black Economic Empowerment [BBBEE] definition of historically marginalized, or in India, based on backward caste), organizations should refer to these local guidelines to identify historically marginalized groups. Otherwise, and wherever appropriate, organizations should provide additional detail regarding their tailored methodology for defining these groups. This metric is multi-dimensional with regard to the five dimensions of impact: it may help describe the WHO dimension when the stakeholder group represented by the metric is the stakeholder group targeted by the investment or organization. It may also help measure the HOW MUCH Scale dimension, which helps estimate the number of the targeted stakeholders experiencing the outcome. For more on the alignment of IRIS metrics to the five dimensions of impact, see IRIS+ and the Five Dimensions of Impact (https://iris.thegiin.org/document/iris-and-the-five-dimensions/). No single metric is sufficient to understand an impact; rather, metrics are selected as a set across all dimensions of impact. When possible, the selection of metrics to measure and describe the five dimensions should be based on best practice and evidence.
defined by: giin

Energy Purchased: Renewable
type: Concept
type: Code
has name: Energy Purchased: Renewable
has description: Amount of purchased energy consumed by the organization from renewable sources during the reporting period.
definition: Amount of purchased energy consumed by the organization from renewable sources during the reporting period.
has identifier: OI3324
notation: OI3324
had primary source: OI3324
note: Organizations should footnote all assumptions used.
scope note: NOTE: This metric will be deprecated in a forthcoming update to the IRIS Catalog of Metrics. Users are advised to instead report Energy Purchased: Total (OI8825), disaggregated by Primary Energy Source (OI3781), all options under Renewable. This metric is intended to capture the amount of renewable energy purchased for use by the organization itself. Renewable energy sources include solar, wind, geothermal, hydro energy, and biomass, among other forms. Organizations may refer to the glossary for additional information. Large-scale hydropower is often excluded from the definition of renewable energy. Although water itself is a renewable resource, the natural ecology of rivers is not, and hydroelectric dams can adversely affect aquatic ecosystems. Organizations can refer to the Low Impact Hydropower Institute (http://lowimpacthydro.org) for further guidance on creating low-impact hydropower operations. In some contexts, this metric can serve as an indicator of whether the outcome being sought by an investor or organization is occurring (the WHAT dimension of impact). For more on the alignment of IRIS metrics to the five dimensions of impact, see IRIS+ and the Five Dimensions of Impact (https://iris.thegiin.org/document/iris-and-the-five-dimensions/). No single metric is sufficient to understand an impact; rather, metrics are selected as a set across all dimensions of impact. When possible, the selection of metrics to measure and describe the five dimensions should be based on best practice and evidence.
defined by: giin

Employee Training and Transition Programs Offered
type: Concept
type: Code
has name: Employee Training and Transition Programs Offered
has description: Describes the type and scope of programs implemented and assistance provided during the reporting period to upgrade employee skills.
definition: Describes the type and scope of programs implemented and assistance provided during the reporting period to upgrade employee skills.
has identifier: OI3368
notation: OI3368
had primary source: OI3368
note: Organizations should footnote all assumptions used.
scope note: This metric is intended to capture a description of the training and transition programs offered to employees. Employee training programs that aim to upgrade skills can include internal training courses, funding support for external training or education, and the provision of sabbatical periods with guaranteed return to employment. Transition assistance programs provided to support employees who are retiring or who have been terminated can include pre-retirement planning for intended retirees, retraining for those intending to continue working, severance pay (which can take into account employee age and years of service), job placement services, and assistance (such as training and counselling) on transitioning to a non-working life. This metric is sourced from GRI Disclosure 404-2: Programs for upgrading employee skills and transition assistance programs.
defined by: giin

New Market Entered
type: Concept
type: Code
has name: New Market Entered
has description: Describes whether the organization entered a new market during the reporting period.
definition: Describes whether the organization entered a new market during the reporting period.
has identifier: OI3441
notation: OI3441
had primary source: OI3441
note: Organizations should footnote all assumptions used, including source(s) of data.
scope note: This metric is intended to capture whether the organization has expanded its operations into a new market during the reporting period, potentially measuring the organization’s contribution to competition in that new market. “Market” refers to a relevant business area (for example, food processing), as well as a country, sector, product, and targeted stakeholders, the details of which organizations should footnote. “Entry” is relative only to the organization’s own operations and is denoted by the establishment of business and commencement of sales. This metric should not be confused with Market Share Increased (OI4211), which applies to organizations that expanded their own market share in an existing market. Only one of these two indicators can apply to an organization at any one time for the same market. International Finance Institutions (IFIs) often use this metric as part of their analysis of private sector development.
defined by: giin

Median Non-Salaried Wage
type: Concept
type: Code
has name: Median Non-Salaried Wage
has description: Median wage paid to non-salaried and full-time, part-time, or temporary employees of the organization during the reporting period. Employees who are salaried should be excluded from this calculation.
definition: Median wage paid to non-salaried and full-time, part-time, or temporary employees of the organization during the reporting period. Employees who are salaried should be excluded from this calculation.
has identifier: OI3480
notation: OI3480
had primary source: OI3480
note: Organizations should footnote the time frame over which this metric is calculated and all assumptions used. See usage guidance for further information.
scope note: This metric is intended to capture the median non-salaried wage paid to employees of the organization during the reporting period. The median is the middle of all values. Organizations are encouraged to narrow the calculation of this median to specific geographies, industries, departments, or positions, and organizations should footnote details on how the calculation was done. Organizations are also encouraged to break down and footnote for each the median respective non-salaried wages for full-time, part-time, and temporary employees. Non-salaried employees are paid on a variable basis (such as hourly, daily, weekly, other specified time cycle, or other specified parameter). Since the time frame for non-salaried employees can vary, organizations should footnote the time frame used in this calculation. Non-salaried employees' earnings are contingent on the amount of time worked.
defined by: giin

Permanent Employees: Hired
type: Concept
type: Code
has name: Permanent Employees: Hired
has description: Number of people hired by the organization during the reporting period, whether they are full-time or part-time.
definition: Number of people hired by the organization during the reporting period, whether they are full-time or part-time.
has identifier: OI3547
notation: OI3547
had primary source: OI3547
note: Organizations should footnote all assumptions used.
scope note: This metric is intended to capture the number of unique individuals hired by the organization into full- or part-time roles during the last reporting period. This metric excludes Temporary Employees (OI9028). This metric is multi-dimensional with regard to the five dimensions of impact: it may help describe the WHO dimension when the stakeholder group represented by the metric is the stakeholder group targeted by the investment or organization. It may also help measure the HOW MUCH Scale dimension, which helps estimate the number of the targeted stakeholders experiencing the outcome. For more on the alignment of IRIS metrics to the five dimensions of impact, see IRIS+ and the Five Dimensions of Impact (https://iris.thegiin.org/document/iris-and-the-five-dimensions/). No single metric is sufficient to understand an impact; rather, metrics are selected as a set across all dimensions of impact. When possible, the selection of metrics to measure and describe the five dimensions should be based on best practice and evidence.
defined by: giin

Employee Feedback and Grievance System
type: Concept
type: Code
has name: Employee Feedback and Grievance System
has description: Indicates whether the organization has in place a grievance mechanism to receive formal employee complaints and provide remedies, as well as an established procedure and/or committee to receive and handle employee feedback.
definition: Indicates whether the organization has in place a grievance mechanism to receive formal employee complaints and provide remedies, as well as an established procedure and/or committee to receive and handle employee feedback.
has identifier: OI3601
notation: OI3601
had primary source: OI3601
note: Organizations should footnote the details on the process and frequency by which they obtain and handle employee feedback. See usage guidance for further information.
scope note: This metric is intended to capture whether organizations have in place a grievance mechanism and system to receive and resolve grievances and complaints. Organizations may also choose to report on additional feedback systems in place to capture positive feedback and questions. Organizations can refer to the glossary for more information on feedback systems. Examples of relevant details to footnote may include: the frequency with which employee feedback is solicited or received, whether the system enables anonymity or confidentiality, whether there are established procedures to handle feedback, whether a regular employee satisfaction survey is conducted, and other relevant aspects of the feedback system. Negative employee feedback, such as an employee complaint, is also known as a grievance if it is a claim by an employee who is being adversely affected by a misinterpretation or misapplication of a written organizational policy or collectively bargained agreement. Employee grievances typically relate to issues such as pay and benefits, workload, working conditions, and union and management relations. For example, a grievance may include an incident of sexual harassment, wage inequity for comparable work, increased workload without increased pay, or unsafe work conditions, among many other scenarios. Organizations can refer to the SPI4 (http://cerise-spi4.squarespace.com/), specifically Essential Practices 5a3 and 5c1, for additional indicators related to employee feedback systems. SPI4 is a social audit tool, developed for financial service providers, which can apply to any organization with both social and financial objectives.
defined by: giin

Meeting Frequency of Board of Directors
type: Concept
type: Code
has name: Meeting Frequency of Board of Directors
has description: Number of times the organization's board of directors or governing body met during the reporting period.
definition: Number of times the organization's board of directors or governing body met during the reporting period.
has identifier: OI3630
notation: OI3630
had primary source: OI3630
note: Organizations should footnote all assumptions used.
scope note: This metric is intended to capture the frequency with which the board of directors or governing body met during the reporting period, a function of effective governance. If the reporting period used is not a year, organizations may wish to indicate the annual frequency of meetings held. For a reporting period of one year, “1," for example, would indicate that the organization's board of directors meets annually, while "2" would indicate that it meets semi-annually and "4" would indicate a quarterly cadence of meetings.
defined by: giin

Water Consumed: Regions with High Water Stress
type: Concept
type: Code
has name: Water Consumed: Regions with High Water Stress
has description: Volume of water used from regions with high or extremely high baseline water stress during the reporting period.
definition: Volume of water used from regions with high or extremely high baseline water stress during the reporting period.
has identifier: OI3637
notation: OI3637
had primary source: OI3637
note: Organizations should footnote all assumptions used, including how high-water-stress regions are identified, how water usage is measured in those regions, and what strategies are in place to reduce water usage in those regions. See usage guidance for additional information.
scope note: This metric is intended to capture the volume of water from high-water-stress regions used within the organization for any purpose, including but not limited to productive processes (for example, packaging and manufacturing), human consumption, and agricultural purposes. Organizations are encouraged to footnote the percentage of their total water use that represents water use from regions with high or extremely high baseline water stress. To calculate this metric (water consumed), subtract the amount of Water Discharged (OI0386) to high-water-stressed areas from the amount of Water Withdrawn (OI0263) from high-water-stressed areas. Report Level of Water Stress (OI2799) to disaggregate land managed by the organization by water stress. For this calculation, organizations should consider “High” or “Extremely High” water stress under Level of Water Stress (OI2799) to be “high water stress.” Water sources include surface water (including water from wetlands, rivers, lakes, and oceans), groundwater, rainwater collected directly and stored by the organization, wastewater obtained from other entities, municipal water supply, or supply from other water utilities. Baseline water stress is total water withdrawal as a percentage of freshwater availability in a specific water source. High water stress is defined as a percentage of 40–80%, and extremely high is defined as a percentage greater than 80%. Organizations can refer to the glossary for further guidance on identifying high or extremely high baseline water stress regions. Organizations may also consult resources such as the World Resources Institute (WRI) Water Risk Atlas Tool (http://www.wri.org/resources/maps/aqueduct-water-risk-atlas) and the WWF-DEG Water Risk Filter (http://waterriskfilter.panda.org/). In some contexts, this metric can serve as an indicator of whether the outcome being sought by an investor or organization is occurring (the WHAT dimension of impact). For more on the alignment of IRIS metrics to the f…
defined by: giin

Departed Permanent Employees: Full-time
type: Concept
type: Code
has name: Departed Permanent Employees: Full-time
has description: Number of full-time employees who departed the organization (for any reason) during the reporting period.
definition: Number of full-time employees who departed the organization (for any reason) during the reporting period.
has identifier: OI3653
notation: OI3653
had primary source: OI3653
note: Organizations should footnote all assumptions used.
scope note: This metric is intended to capture the number of full-time permanent employees who left their employment with the organization during the reporting period for any reason. This metric is multi-dimensional with regard to the five dimensions of impact. It may help describe the WHO dimension when the stakeholder group represented by the metric is the stakeholder group targeted by the investment or organization. It may also help measure the HOW MUCH Scale dimension, which helps estimate the number of the targeted stakeholders experiencing the outcome. For more on the alignment of IRIS metrics to the five dimensions of impact, see IRIS+ and the Five Dimensions of Impact (https://iris.thegiin.org/document/iris-and-the-five-dimensions/). No single metric is sufficient to understand an impact; rather, metrics are selected as a set across all dimensions of impact. When possible, the selection of metrics to measure and describe the five dimensions should be based on best practice and evidence.
defined by: giin

Employees Covered by Collective Bargaining Agreements
type: Concept
type: Code
has name: Employees Covered by Collective Bargaining Agreements
has description: Number of employees (including both permanent and temporary workers) who are covered by collective bargaining agreements as of the end of the reporting period.
definition: Number of employees (including both permanent and temporary workers) who are covered by collective bargaining agreements as of the end of the reporting period.
has identifier: OI3703
notation: OI3703
had primary source: OI3703
note: Organizations should footnote all assumptions used, including which groups of employees are and are not covered by collective bargaining agreements.
scope note: This metric is intended to capture the number of an organization's total employees who are protected by collective bargaining agreements. It may be divided by the total number of employees (Permanent Employees: Total [OI8869] + Temporary Employees [OI9028]) to capture the percentage (× 100) of all employees protected by collective bargaining agreements. Collective bargaining is defined as "all negotiations which take place between one or more employers or employers' organizations, on the one hand, and one or more workers' organizations (trade unions), on the other, for determining working conditions and terms of employment or for regulating relations between employers and workers. Collective agreements can be at the level of the organization; at the industry level, in countries where that is the practice; or at both. Collective agreements can cover specific groups of workers; for example, those performing a specific activity or working at a specific location. This definition is based on the International Labour Organization (ILO) Convention 154, ‘Collective Bargaining Convention’, 1981" (GRI Disclosure 402-1). Organizations should note whether all employees are able to participate in collective bargaining agreements and, if not, which employees are unable to participate. This metric may help describe the HOW MUCH Scale dimension, which helps estimate the number of the targeted stakeholders experiencing the outcome. For more on the alignment of IRIS metrics to the five dimensions of impact, see IRIS+ and the Five Dimensions of Impact (https://iris.thegiin.org/document/iris-and-the-five-dimensions/). No single metric is sufficient to understand an impact; rather, metrics are selected as a set across all dimensions of impact. The selection of metrics to measure and describe the five dimensions should be based on best practice and evidence.
defined by: giin

Occupational Injuries
type: Concept
type: Code
has name: Occupational Injuries
has description: Number of occupational injuries which affected any full-time, part-time, and temporary employees of the organization during the reporting period.
definition: Number of occupational injuries which affected any full-time, part-time, and temporary employees of the organization during the reporting period.
has identifier: OI3757
notation: OI3757
had primary source: OI3757
note: Organizations should footnote the types of occupational injuries and mitigation actions going forward.
scope note: This metric is intended to capture the number of work-related injuries arising from exposure to hazards at work. If the same employee experienced more than one occupational injury, each instance of injury should be counted separately. That is, an individual injured twice during the reporting period would count as two injuries. This metric is sourced from GRI Disclosure 403-10: Work-related Ill Health. Work-related injuries and ill health are those that arise from exposure to hazards at work. Other types of incidents can occur that are not connected with the work itself. For more guidance, see GRI Disclosure 403-10 (https://www.globalreporting.org/standards/media/1910/gri-403-occupational-health-and-safety-2018.pdf).
defined by: giin

Primary Energy Source
type: Concept
type: Code
has name: Primary Energy Source
has identifier: OI3781
notation: OI3781
had primary source: OI3781
note: Organizations should footnote all assumptions used, including source of data or disaggregation and any other disaggregations applied.
scope note: This metric is intended to capture a description of the primary source(s) of energy produced, sold, or purchased by the organization during the reporting period. Organizations are encouraged to footnote the percentage of their energy in each category. This disaggregation, applied to another metric, is intended to capture the share of that metric which comes from the selected primary energy source(s). For example, the disaggregation "Renewable, clean sources" when applied to Energy Generated for Sale (PI8706) would include the amount of renewable, clean energy sold by the organization during the reporting period. Large-scale hydropower is often excluded from the definition of renewable energy. Although water itself is a renewable resource, the natural ecology of rivers is not, and hydroelectric dams can adversely affect aquatic ecosystems. Organizations can refer to the Low Impact Hydropower Institute (<http://lowimpacthydro.org>) for further guidance on creating low-impact hydropower operations.
has description: Describes the primary source(s) for energy produced, sold, or purchased by the organization during the reporting period, or disaggregates another metric in terms of the primary source of the related amount of energy. Select all that apply: Non-renewable sources: - Coal - Crude oil derivatives - Natural gas - Other (write-in) Renewable sources: - Biomass - Geothermal - Hydro energy - Nuclear - Solar - Wind - Other (write-in) Other (write-in)
definition: Describes the primary source(s) for energy produced, sold, or purchased by the organization during the reporting period, or disaggregates another metric in terms of the primary source of the related amount of energy. Select all that apply: Non-renewable sources: - Coal - Crude oil derivatives - Natural gas - Other (write-in) Renewable sources: - Biomass - Geothermal - Hydro energy - Nuclear - Solar - Wind - Other (write-in) Other (write-in)

Stream Nutrient Levels Assessment
type: Concept
type: Code
has name: Stream Nutrient Levels Assessment
has description: Indicates whether the organization has assessed nitrogen and phosphorus levels in streams on directly or indirectly controlled land as of the end of the reporting period.
definition: Indicates whether the organization has assessed nitrogen and phosphorus levels in streams on directly or indirectly controlled land as of the end of the reporting period.
has identifier: OI3798
notation: OI3798
had primary source: OI3798
note: Organizations should footnote all assumptions used, including which tools or methodologies were used to assess nutrient levels.
scope note: The metric is intended to capture whether the organization has measured nitrogen and phosphorus levels in streams or rivers on land it manages. Nitrogen and phosphorus levels are key determinants of stream health. Although nitrogen and phosphorus are crucial for life on Earth, agricultural fertilization, cattle breeding, and industrial emissions can oversaturate ecosystems with these elements, which leads to habitat degradation by eutrophication. Organizations should measure nutrients, including phosphorus and nitrogen, immediately downstream of controlled land—as reported by Land Directly Controlled: Total (OI5408), Land Indirectly Controlled: Total (PI3789), and related submetrics—and preferably at both base and storm flows. Guidance on measuring nitrogen and phosphorus concentrations can be found at EPA’s Total Nitrogen (https://www.epa.gov/sites/production/files/2015-09/documents/totalnitrogen.pdf) and Phosphorus (https://archive.epa.gov/water/archive/web/html/vms56.html) pages. Organizations are encouraged to footnote summary statistics of these data and should consult national, sub-national, or tribal standards to determine whether measured nutrient levels are within environmentally sustainable levels, as local and international water quality legislation often specify limits and target values for nutrient levels in water.
defined by: giin

Fair Compensation Policy
type: Concept
type: Code
has name: Fair Compensation Policy
has description: Indicates whether the organization has a written policy regarding fair and equitable compensation for employees and a system to monitor compliance with this policy.
definition: Indicates whether the organization has a written policy regarding fair and equitable compensation for employees and a system to monitor compliance with this policy.
has identifier: OI3819
notation: OI3819
had primary source: OI3819
note: Organizations should footnote details on how they determine the compensation of employees. See usage guidance for further information.
scope note: This metric is intended to capture the organization’s compensation on equitable compensation. Organizations are encouraged to footnote details on how they determine fair compensation (for example, if they conduct a compensation benchmark survey).
defined by: giin

Critical Marine Habitats
type: Concept
type: Code
has name: Critical Marine Habitats
has description: Indicates whether the marine and coastal spaces directly controlled, indirectly controlled, or used (such as for transport) by the organization include important marine habitats for species.
definition: Indicates whether the marine and coastal spaces directly controlled, indirectly controlled, or used (such as for transport) by the organization include important marine habitats for species.
has identifier: OI3846
notation: OI3846
had primary source: OI3846
note: Organizations should footnote all assumptions used, including source of data.
scope note: This metric is intended to capture whether marine and coastal spaces under the organization’s control or use, whether direct or indirect, include important marine habitats for species. Datasets on important marine and coastal habitats and species can be applied to support decisions during biodiversity risk screening or to identify conservation and restoration opportunities. The Ocean Data Viewer by Ocean+ (see https://data.unep-wcmc.org/ and https://oceanplus.org/) includes various spatial datasets, such as the distribution of coral reefs, mangroves, and seagrasses, as well as distribution of marine mammals and even feeding and nesting sites for marine turtles. Investors are strongly encouraged to contextualize their projects – and ideally select projects – based on broader, country- or region-level biodiversity and landscape assessments focused on site irreplaceability. Viewing biodiversity through the lens of a systematic conservation plan enables more efficient, impact goal-oriented management decisions.
defined by: giin

Full-time Wages: Historically Marginalized Management
type: Concept
type: Code
has name: Full-time Wages: Historically Marginalized Management
has description: Value of wages (including bonuses and excluding benefits) paid to all full-time management employees (managers) of the organization during the reporting period who belong to groups historically marginalized on the basis of race and/or ethnicity.
definition: Value of wages (including bonuses and excluding benefits) paid to all full-time management employees (managers) of the organization during the reporting period who belong to groups historically marginalized on the basis of race and/or ethnicity.
has identifier: OI3862
notation: OI3862
had primary source: OI3862
note: Organizations should footnote how their organization defines management levels, as well as their categorization of historically marginalized groups. See usage guidance for further information.
scope note: This metric is intended to capture pre-tax wages and salaries paid to the organization's management employees who belong to historically marginalized groups and should include neither benefits nor payroll expenses. This metric should exclude Temporary Employee Wages (OI4202). Organizations can refer to the glossary for additional guidance on defining management. The composition of management varies with an organization's stage and type, but managers are generally responsible for setting objectives (defining goals for the group and deciding what work must be done to meet those goals), organizing (dividing work into manageable activities and selecting the right people to accomplish them), motivating and communicating (creating a team out of individuals through decisions on pay, promotion, and communications), measuring (establishing targets and interpreting and analyzing performance), and developing people. The categorization of historically marginalized groups varies with location and context. With no internationally agreed-upon definition as to which groups constitute historically marginalized on the basis of race and/or ethnicity, if well-established local policies exist (as in South Africa, with the Broad Based Black Economic Empowerment [BBBEE] definition of historically marginalized, or in India, based on backward caste), organizations should refer to these local guidelines to identify groups historically marginalized on the basis of race and/or ethnicity. Otherwise, and wherever appropriate, organizations should provide additional detail regarding their tailored methodology for defining these groups.
defined by: giin

Social and Environmental Performance Staff Training
type: Concept
type: Code
has name: Social and Environmental Performance Staff Training
has description: Indicates whether any of the organization's employees participated in training sessions related to any aspect of managing environmental or social performance during the reporting period.
definition: Indicates whether any of the organization's employees participated in training sessions related to any aspect of managing environmental or social performance during the reporting period.
has identifier: OI3943
notation: OI3943
had primary source: OI3943
note: Organizations should footnote details on the type and duration of training. See usage guidance for further information.
scope note: This metric is intended to capture whether any members of an organization's staff participated in training related to social and environmental performance during the reporting period. To quantify the number of employees trained, use Employees Trained (OI4229). Examples of training include sessions on: acceptable practices for payment collection; being responsive to client needs; collecting high-quality social information; communicating with clients regarding product pricing, terms, and conditions; enacting gender sensitivity; preventing over-indebtedness; implementing policy and procedures to safeguard client data; measuring poverty levels; and handling client complaints appropriately. Organizations should footnote details on the trainings provided.
defined by: giin

Stream Turbidity Level
type: Concept
type: Code
has name: Stream Turbidity Level
has description: Level of turbidity (in Nephelometric Turbidity Units, or NTU) observed in streams or rivers on land directly or indirectly managed by the organization as of the end of the reporting period.
definition: Level of turbidity (in Nephelometric Turbidity Units, or NTU) observed in streams or rivers on land directly or indirectly managed by the organization as of the end of the reporting period.
has identifier: OI3979
notation: OI3979
had primary source: OI3979
note: Organizations should footnote all assumptions used, including source(s) of data.
scope note: The metric is intended to capture the level of turbidity in streams or rivers on land managed by the organization as of the end of the reporting period. Organizations should collect these data immediately downstream of controlled land, as reported by Land Directly Controlled: Total (OI5408), Land Indirectly Controlled: Total (PI3789), and related submetrics. Turbidity measurements should be taken seasonally, because streamflow varies seasonally. Organizations should consult national, sub-national, or tribal standards to determine whether measured turbidity levels are within environmentally sustainable levels. Guidance on turbidity measurements can be found from the US Environmental Protection Agency (https://www.epa.gov/sites/production/files/2015-09/documents/turbidity.pdf) and USGS (https://www.usgs.gov/special-topic/water-science-school/science/turbidity-and-water?qt-science_center_objects=0#qt-science_center_objects). For guidance on turbidity measurement conversions, see USGS guidance (https://or.water.usgs.gov/grapher/fnu.html).
defined by: giin

Employee Involuntary Turnover Rate
type: Concept
type: Code
has name: Employee Involuntary Turnover Rate
has description: Ratio of the number of involuntarily departing permanent (full- and part-time) employees compared to the average number of permanent (full- and part-time) employees at the organization during the reporting period.
definition: Ratio of the number of involuntarily departing permanent (full- and part-time) employees compared to the average number of permanent (full- and part-time) employees at the organization during the reporting period.
has identifier: OI3989
notation: OI3989
had primary source: OI3989
note: Organizations should footnote all assumptions used. See usage guidance for further information.
scope note: This metric is intended to capture the rate at which permanent employees depart the organization involuntarily. Refer to Departed Permanent Employees: Involuntary (OI7225) for additional information. For employees departing the organization voluntarily, organizations can use the metrics Departed Permanent Employees: Voluntary (OI8431) and Employee Voluntary Turnover Rate (OI1638). The average number of permanent employees can be calculated in several ways. One example for organizations reporting on a yearly basis is to calculate the average number of permanent employees on a monthly basis under Permanent Employees: Total (OI8869).
defined by: giin

Water Conserved
type: Concept
type: Code
has name: Water Conserved
has description: Volume of water usage reduced as a result of the organization's water conservation efforts during the reporting period.
definition: Volume of water usage reduced as a result of the organization's water conservation efforts during the reporting period.
has identifier: OI4015
notation: OI4015
had primary source: OI4015
note: Organizations should footnote all assumptions used. See usage guidance for further information.
scope note: This metric is intended to capture the reduction in water usage resulting from the organization’s water conservation during the report period. Water conservation efforts could include low-flow toilets, rainwater collection facilities, or improved manufacturing processes. Organizations should not include overall reduced water usage resulting from reduced organizational activities (e.g., partial outsourcing of operations). Organizations should footnote all assumptions used, including the basis for calculating reductions in water usage (such as base year or baseline) and the rationale for choosing that basis. For example, if the reporting period is annual, organizations should report on the difference in water use between the current year and previous year. Additionally, organizations are encouraged to footnote water conserved as a percentage of the total water consumed by the organization. Organizations are encouraged to report this metric in conjunction with Water Conservation Strategy (OI9326). In some contexts, this metric may help measure the HOW MUCH Depth dimension of impact, which helps estimate the degree of change in outcome that the stakeholders experienced. For more on the alignment of IRIS metrics to the five dimensions of impact, see IRIS+ and the Five Dimensions of Impact (https://iris.thegiin.org/document/iris-and-the-five-dimensions/). No single metric is sufficient to understand an impact; rather, metrics are selected as a set across all dimensions of impact. When possible, the selection of metrics to measure and describe the five dimensions should be based on best practice and evidence.
defined by: giin

Permanent Employees: People with Disabilities
type: Concept
type: Code
has name: Permanent Employees: People with Disabilities
has description: Number of people with disabilities in paid employment with the organization as of the end of the reporting period, whether they are full-time or part-time.
definition: Number of people with disabilities in paid employment with the organization as of the end of the reporting period, whether they are full-time or part-time.
has identifier: OI4038
notation: OI4038
had primary source: OI4038
note: Organizations should footnote all assumptions used, as well as any specific focus on stakeholders with particular disabilities.
scope note: This metric is intended to capture the number of unique individuals with disabilities employed by the organization in full- or part-time roles as of the end of the reporting period. This metric excludes Temporary Employees (OI9028). This metric is multi-dimensional with regard to the five dimensions of impact: it may help describe the WHO dimension when the stakeholder group represented by the metric is the stakeholder group targeted by the investment or organization. It may also help measure the HOW MUCH Scale dimension, which helps estimate the number of the targeted stakeholders experiencing the outcome. For more on the alignment of IRIS metrics to the five dimensions of impact, see IRIS+ and the Five Dimensions of Impact. No single metric is sufficient to understand an impact; rather, metrics are selected as a set across all dimensions of impact. When possible, the selection of metrics to measure and describe the five dimensions should be based on best practice and evidence.
defined by: giin

Healthcare Benefits Participants
type: Concept
type: Code
has name: Healthcare Benefits Participants
has description: Number of employees who received healthcare benefits through the organization’s programs during the reporting period.
definition: Number of employees who received healthcare benefits through the organization’s programs during the reporting period.
has identifier: OI4061
notation: OI4061
had primary source: OI4061
note: Organizations should footnote the types of benefits provided. See usage guidance for further information.
scope note: This metric is intended to capture how many employees received healthcare through the organization’s benefits during the reporting period. Types of healthcare benefits provided by the organization could include primary care, outpatient care, inpatient care, maternal services, dental care, vision care, hearing care, prescription drugs, prenatal care, mental health services, family planning, and preventative screening, among others. Organizations should footnote which types of benefits are provided. This metric is multi-dimensional with regard to the five dimensions of impact: it may help describe the WHO dimension when the stakeholder group represented by the metric is the stakeholder group targeted by the investment or organization. It may also help measure the HOW MUCH Scale dimension, which helps estimate the number of the targeted stakeholders experiencing the outcome. For more on the alignment of IRIS metrics to the five dimensions of impact, see IRIS+ and the Five Dimensions of Impact (https://iris.thegiin.org/document/iris-and-the-five-dimensions/). No single metric is sufficient to understand an impact; rather, metrics are selected as a set across all dimensions of impact. When possible, the selection of metrics to measure and describe the five dimensions should be based on best practice and evidence.
defined by: giin

Board of Directors: Independent
type: Concept
type: Code
has name: Board of Directors: Independent
has description: Number of independent members of the organization's board of directors or governing body as of the end of the reporting period.
definition: Number of independent members of the organization's board of directors or governing body as of the end of the reporting period.
has identifier: OI4070
notation: OI4070
had primary source: OI4070
note: Organizations should footnote all assumptions used.
scope note: This metric is intended to capture the size of independent representation within the board of directors or governing body of an organization. A board of directors is a group of individuals legally responsible to govern a corporation and responsible to the shareholders and other relevant stakeholders. A governing body with a different name (e.g., "advisory body") may be considered a Board of Directors provided it has a fiduciary and/or social responsibility to shareholders and/or other relevant stakeholders. Independent board members are defined as individuals who are not an employee of the organization, non-management, and neither material investors/owners (owning less than 5%) nor a spouse or family member of a material owner. These board members’ independence is maintained in order to ensure they are not influenced by specific interests of the organization. This metric is multi-dimensional with regard to the five dimensions of impact. It may help describe the WHO dimension when the stakeholder group represented by the metric is the stakeholder group targeted by the investment or organization. It may also help measure the HOW MUCH Scale dimension, which helps estimate the number of the targeted stakeholders experiencing the outcome. For more on the alignment of IRIS metrics to the five dimensions of impact, see IRIS+ and the Five Dimensions of Impact (https://iris.thegiin.org/document/iris-and-the-five-dimensions/). No single metric is sufficient to understand an impact; rather, metrics are selected as a set across all dimensions of impact. When possible, the selection of metrics to measure and describe the five dimensions should be based on best practice and evidence.
defined by: giin

Greenhouse Gas Emissions: Direct (Scope 1)
type: Concept
type: Code
has name: Greenhouse Gas Emissions: Direct (Scope 1)
has description: Amount of greenhouse gases (GHG) emitted from direct emissions sources as a result of the organization's operations during the reporting period.
definition: Amount of greenhouse gases (GHG) emitted from direct emissions sources as a result of the organization's operations during the reporting period.
has identifier: OI4112
notation: OI4112
had primary source: OI4112
note: Organizations should footnote all assumptions used, including detailed information on their calculation methodology and source of data. See usage guidance for further information.
scope note: This metric is intended to capture the amount of greenhouse gases emitted directly from sources owned or controlled by the organization during the reporting period. For tools that may be helpful in calculating this and related metrics, see GHG Protocol Calculators (https://ghgprotocol.org/calculation-tools). The Greenhouse Gas Protocol (GHG Protocol) classifies direct emissions as "Scope 1" emissions. The GHG Protocol, the most widely used international accounting tool to understand, quantify, and manage greenhouse gas emissions, defines direct emissions as emissions from sources that are owned or controlled by the reporting entity. For more information on the GHG Protocol, organizations should refer to the following: - Greenhouse Gas Protocol Standards (http://www.ghgprotocol.org/standards) - Greenhouse Gas Protocol Calculators (https://ghgprotocol.org/calculation-tools) Direct GHG emissions come from sources that are owned or controlled by the reporting organization. For example, direct emissions related to combustion would arise from burning fuel for energy within the reporting organization's operational boundaries. Organizations are also encouraged to report Greenhouse Gas Emissions Strategy (OI8237). In some contexts, this metric can serve as an indicator of whether the outcome being sought by an investor or organization is occurring (the WHAT dimension of impact). For more on the alignment of IRIS metrics to the five dimensions of impact, see IRIS+ and the Five Dimensions of Impact (https://iris.thegiin.org/document/iris-and-the-five-dimensions/). No single metric is sufficient to understand an impact; rather, metrics are selected as a set across all dimensions of impact. When possible, the selection of metrics to measure and describe the five dimensions should be based on best practice and evidence.
defined by: giin

Social and Environmental Performance Management Training
type: Concept
type: Code
has name: Social and Environmental Performance Management Training
has description: Indicates whether any member of the organization's board of directors participated in training sessions related to any aspect of managing environmental or social performance during the reporting period.
definition: Indicates whether any member of the organization's board of directors participated in training sessions related to any aspect of managing environmental or social performance during the reporting period.
has identifier: OI4136
notation: OI4136
had primary source: OI4136
note: Organizations should footnote details on the type and duration of training. See usage guidance for further information.
scope note: This metric is intended to capture whether any members of an organization's board of directors participated in training related to social and environmental performance during the reporting period. To quantify the number of employees trained, use Employees Trained (OI4229). Examples of training include sessions on: acceptable practices for payment collection; being responsive to client needs; collecting high-quality social information; communicating with clients regarding product pricing, terms, and conditions; enacting gender sensitivity; preventing over-indebtedness; implementing policy and procedures to safeguard client data; measuring poverty levels; and handling client complaints appropriately. Organizations should footnote details on the trainings provided.
defined by: giin

Traceability System
type: Concept
type: Code
has name: Traceability System
has description: Indicates whether the organization implements a traceability system for its raw materials.
definition: Indicates whether the organization implements a traceability system for its raw materials.
has identifier: OI4194
notation: OI4194
had primary source: OI4194
note: Organizations should footnote the relevant details about their traceability system. See usage guidance for further information.
scope note: This metric is intended to capture detailed information on the traceability system in place but does not evaluate the success with which that system is implemented. A traceability system enables organizations to follow the original source(s) of raw materials and their routes to the organization by tracing, tracking, and certifying materials at all stages of production, from extraction to markets. Many organizations use traceability systems to reduce illegal activities (e.g., illegal logging, mining, or wildlife trade). This metric is most applicable to organizations operating in forestry, minerals, extractives, animal products, healthcare, or agriculture, among other industries. Examples of details to footnote regarding traceability systems may include: the level to which raw materials are traceable (e.g., country, province, district, or exact location within a few kilometers’ radius), protocol documents, generated reports, and third-party verification and certification. Organizations can use Product/Service Certifications (PD2756) to report any relevant certifications resulting from the traceability system. For further guidance, organizations can refer to The Global Language of Business (http://www.gs1.org/traceability).
defined by: giin

Temporary Employee Wages
type: Concept
type: Code
has name: Temporary Employee Wages
has description: Value of wages (including bonuses and excluding benefits) paid to all temporary employees of the organization during the reporting period.
definition: Value of wages (including bonuses and excluding benefits) paid to all temporary employees of the organization during the reporting period.
has identifier: OI4202
notation: OI4202
had primary source: OI4202
note: Organizations should footnote all assumptions used.
scope note: This metric is intended to capture pre-tax wages and salaries paid to the organization's temporary employees and should include neither benefits nor payroll expenses.
defined by: giin

Market Share Increased
type: Concept
type: Code
has name: Market Share Increased
has description: Describes whether the organization expanded operations and increased market share during the reporting period in a concentrated market in which the organization was not a dominant player.
definition: Describes whether the organization expanded operations and increased market share during the reporting period in a concentrated market in which the organization was not a dominant player.
has identifier: OI4211
notation: OI4211
had primary source: OI4211
note: Organizations should footnote all assumptions used, including source(s) of data.
scope note: This metric is intended to capture whether the organization expanded its operations to cover a greater share of a market in which it was previously active, potentially measuring the organization’s contribution to competition in that existing market. This metric should not be confused with New Market Entered (OI3441), which applies to organizations that have just entered the relevant market. Only one of these two indicators can apply to an organization at any one time for the same market. The organization should define and footnote “Dominant” and “Concentrated” based on the context in which it operates. For example, in some markets, a dominant firm may have over 50% market share while, in another, a firm may be dominant with just 20% share. Market concentration is determined by the number of firms in a market and their respective shares of the relevant market. Hence, a “concentrated” market typically features fewer firms with larger market shares, with or without a dominant player. International Finance Institutions (IFIs) often use this metric as part of their analysis of private sector development.
defined by: giin

Ownership Demographics
type: Concept
type: Code
has name: Ownership Demographics
has identifier: OI4221
notation: OI4221
had primary source: OI4221
note: Organizations should footnote all assumptions used, including source of data or disaggregation and any other disaggregations applied.
scope note: This metric is intended to capture the basic demographic groups in an organization's ownership. The thresholds by group follow these sources: - Gender: 51% female or gender non-binary, following the 2X Challenge criteria (https://www.2xchallenge.org/criteria). This disaggregation, applied to another metric, is intended to capture the share of that metric which relates to the selected demographic groups in ownership. For example, when applied to Client Organizations (PI9652), this disaggregation would capture the number of client organizations with ownership in the selected demographic group(s). Owners should self-report their own demographic data to ensure accuracy, particularly for race and gender. Organizations should not assume gender for an individual and should protect vulnerable individuals in the LGBTQIA+ spectrum by reporting these data anonymously and in aggregate. Given that transwomen are women and transmen are men, this metric does not create separate segmentations for those groups. However, organizations are encouraged to create additional groupings using the write-in option as needed to capture those lived experiences that are helpful in understanding equity in outcomes.
has description: Describes the demographics of the ownership of the organization, or disaggregates another metric in terms of one or more demographic groups of ownership. Particular thresholds apply to consider an organization "owned" by members of a demographic group; see usage guidance for further information. Select all that apply: Gender: - 51% or Greater Female or Gender Non-Binary - Undisclosed - Other Disability Status: - Persons with disabilities - Persons without disabilities - Undisclosed - Other Race/Ethnicity/Minority Status: - Historically marginalized groups - Dominant culture populations - Undisclosed Other target populations: - Other (describe)
definition: Describes the demographics of the ownership of the organization, or disaggregates another metric in terms of one or more demographic groups of ownership. Particular thresholds apply to consider an organization "owned" by members of a demographic group; see usage guidance for further information. Select all that apply: Gender: - 51% or Greater Female or Gender Non-Binary - Undisclosed - Other Disability Status: - Persons with disabilities - Persons without disabilities - Undisclosed - Other Race/Ethnicity/Minority Status: - Historically marginalized groups - Dominant culture populations - Undisclosed Other target populations: - Other (describe)
defined by: giin

Employees Trained
type: Concept
type: Code
has name: Employees Trained
has description: Number of employees (full-time, part-time, or temporary) who were trained through programs provided by the organization (both internally and externally) during the reporting period.
definition: Number of employees (full-time, part-time, or temporary) who were trained through programs provided by the organization (both internally and externally) during the reporting period.
has identifier: OI4229
notation: OI4229
had primary source: OI4229
note: Organizations should footnote the types of training provided and duration of training(s), with particular emphasis on those that lead to recognized certifications.
scope note: This metric is intended to capture the number of individual employees who received training services of any type from the organization during the reporting period. Training can be categorized as: (a) skills-based training to advance core job responsibilities (enhancing employees' ability to do their jobs effectively); (b) skills-based training on cross-job functions (training beyond regular job responsibilities, enabling employees' to advance in their professions); (c) training on literacy, communications, and other life skills; or (d) trainings related to diversity and inclusion (for example, training on implicit bias or sexual harassment). Organizations should footnote details on the training(s) provided, including the type. Registrations for training should not be counted under this metric. Rather, this metric should count those employees who completed a training session or series during the reporting period. A description of the training provided should be footnoted, aligning with the descriptive metric GRI 404-2: Programs for upgrading employee skills and transition programs. This metric is multi-dimensional with regard to the five dimensions of impact. It may help describe the WHO dimension when the stakeholder group represented by the metric is the stakeholder group targeted by the investment or organization. It may also help measure the HOW MUCH Scale dimension, which helps estimate the number of the targeted stakeholders experiencing the outcome. For more on the alignment of IRIS metrics to the five dimensions of impact, see IRIS+ and the Five Dimensions of Impact (https://iris.thegiin.org/document/iris-and-the-five-dimensions/). No single metric is sufficient to understand an impact; rather, metrics are selected as a set across all dimensions of impact. When possible, the selection of metrics to measure and describe the five dimensions should be based on best practice and evidence.
defined by: giin

Community Service Policy
type: Concept
type: Code
has name: Community Service Policy
has description: Indicates whether the organization implements a community service policy.
definition: Indicates whether the organization implements a community service policy.
has identifier: OI4324
notation: OI4324
had primary source: OI4324
note: Organizations should footnote the relevant details of their community service policy, including the activities that result from it. See usage guidance for further information.
scope note: This metric is intended to capture the organization’s policy on community service. Examples of policy details to footnote may include provisions for time spent volunteering during traditional work hours, whether for company-organized events (e.g., organization-wide service days) or employee-initiated activities (e.g., service sabbaticals or leaves of absence to complete charitable services). Community service policies may also include a provision for serving on an organization's board or governing body.
defined by: giin

Recycled Materials
type: Concept
type: Code
has name: Recycled Materials
has description: Amount of recycled material used in the organization's products (including packaging) during the reporting period.
definition: Amount of recycled material used in the organization's products (including packaging) during the reporting period.
has identifier: OI4328
notation: OI4328
had primary source: OI4328
note: Organizations should footnote all assumptions used.
scope note: This metric is intended to capture the quantity of recycled material used in the organization’s products during the reporting period. In some contexts, this metric can serve as an indicator of whether the outcome being sought by an investor or organization is occurring (the WHAT dimension of impact). For more on the alignment of IRIS metrics to the five dimensions of impact, see IRIS+ and the Five Dimensions of Impact (https://iris.thegiin.org/document/iris-and-the-five-dimensions/). No single metric is sufficient to understand an impact; rather, metrics are selected as a set across all dimensions of impact. When possible, the selection of metrics to measure and describe the five dimensions should be based on best practice and evidence.
defined by: giin

Worker Freedom of Association Policy
type: Concept
type: Code
has name: Worker Freedom of Association Policy
has description: Indicates whether the organization has a written policy to monitor, evaluate, and ensure its workers' freedom of association.
definition: Indicates whether the organization has a written policy to monitor, evaluate, and ensure its workers' freedom of association.
has identifier: OI4364
notation: OI4364
had primary source: OI4364
note: Organizations should footnote the relevant details of their worker freedom of association policy, including how it is enforced. See usage guidance for further information.
scope note: This metric is intended to capture the organization’s policy on Freedom of Association, which means allowing workers to form and join trade unions, worker associations, and worker councils or committees of their own choosing. Examples of relevant policies to footnote may include allowing workers to participate in the setting or revision of workplace rules and standards and distributing an employee handbook to all workers (written in their native language) that describes both legal requirements and the organization's policies and procedures on freedom of association. For further guidance, organizations can refer to International Labour Organization standards (http://www.ilo.org/global/standards/subjects-covered-by-international-labour-standards/freedom-of-association/lang--en/index.htm).
defined by: giin

Forced Labor Policy: Child Labor
type: Concept
type: Code
has name: Forced Labor Policy: Child Labor
has description: Indicates whether the organization has a written policy against child labor and a system to monitor compliance with this policy.
definition: Indicates whether the organization has a written policy against child labor and a system to monitor compliance with this policy.
has identifier: OI4432
notation: OI4432
had primary source: OI4432
note: Organizations should footnote the relevant details and description of their child labor policy, including details of how it is enforced.
scope note: This metric is intended to capture the organization’s policy on child labor. For further guidance, organizations can refer to International Labour Organization standards (http://www.ilo.org/ipec/facts/ILOconventionsonchildlabour/lang--en/index.htm) and guidelines (http://www.ilo.org/ipec/Informationresources/WCMS_IPEC_PUB_27555/lang--en/index.htm).
defined by: giin

Water Consumed: Groundwater
type: Concept
type: Code
has name: Water Consumed: Groundwater
has description: Volume of groundwater used for the organization's operations during the reporting period.
definition: Volume of groundwater used for the organization's operations during the reporting period.
has identifier: OI4467
notation: OI4467
had primary source: OI4467
note: Organizations should footnote all assumptions used.
scope note: This metric is intended to capture the volume of groundwater used within the organization for any purpose, including but not limited to productive processes (for example, packaging and manufacturing), human consumption, and agricultural purposes. This metric applies to organizations sourcing their water directly from a water body rather than from a water service provider. This metric, as well as other metrics calculated using Water Withdrawn (OI0263) and Water Discharged (OI0386), can be used in conjunction with Water Type (OD7536) to describe water consumption in more detail. For further guidance on water uses, see the Alliance for Water Efficiency (http://www.allianceforwaterefficiency.org). In some contexts, this metric can serve as an indicator of whether the outcome being sought by an investor or organization is occurring (the WHAT dimension of impact). For more on the alignment of IRIS metrics to the five dimensions of impact, see IRIS+ and the Five Dimensions of Impact (https://iris.thegiin.org/document/iris-and-the-five-dimensions/). No single metric is sufficient to understand an impact; rather, metrics are selected as a set across all dimensions of impact. When possible, the selection of metrics to measure and describe the five dimensions should be based on best practice and evidence.
defined by: giin

Waste Disposed: Landfill
type: Concept
type: Code
has name: Waste Disposed: Landfill
has description: Amount of waste disposed by the organization in landfills during the reporting period.
definition: Amount of waste disposed by the organization in landfills during the reporting period.
has identifier: OI4483
notation: OI4483
had primary source: OI4483
note: Organizations should footnote all assumptions used.
scope note: This metric is intended to capture the quantity of the organization’s waste disposed in a landfill during the reporting period. In some contexts, this metric can serve as an indicator of whether the outcome being sought by an investor or organization is occurring (the WHAT dimension of impact). For more on the alignment of IRIS metrics to the five dimensions of impact, see IRIS+ and the Five Dimensions of Impact (https://iris.thegiin.org/document/iris-and-the-five-dimensions/). No single metric is sufficient to understand an impact; rather, metrics are selected as a set across all dimensions of impact. When possible, the selection of metrics to measure and describe the five dimensions should be based on best practice and evidence.
defined by: giin

Departed Permanent Employees: Total
type: Concept
type: Code
has name: Departed Permanent Employees: Total
has description: Number of full- and part-time employees who departed the organization (for any reason) during the reporting period.
definition: Number of full- and part-time employees who departed the organization (for any reason) during the reporting period.
has identifier: OI4499
notation: OI4499
had primary source: OI4499
note: Organizations should footnote all assumptions used.
scope note: This metric is intended to capture the number of permanent employees, whether full- or part-time, who left their employment with the organization during the reporting period for any reason. This metric is multi-dimensional with regard to the five dimensions of impact. It may help describe the WHO dimension when the stakeholder group represented by the metric is the stakeholder group targeted by the investment or organization. It may also help measure the HOW MUCH Scale dimension, which helps estimate the number of the targeted stakeholders experiencing the outcome. For more on the alignment of IRIS metrics to the five dimensions of impact, see IRIS+ and the Five Dimensions of Impact (https://iris.thegiin.org/document/iris-and-the-five-dimensions/). No single metric is sufficient to understand an impact; rather, metrics are selected as a set across all dimensions of impact. When possible, the selection of metrics to measure and describe the five dimensions should be based on best practice and evidence.
defined by: giin

Energy Conservation Strategy
type: Concept
type: Code
has name: Energy Conservation Strategy
has description: Indicates whether the organization implements an energy conservation strategy to reduce its operational energy usage.
definition: Indicates whether the organization implements an energy conservation strategy to reduce its operational energy usage.
has identifier: OI4531
notation: OI4531
had primary source: OI4531
note: Organizations should footnote the details of the strategy, including how it is being implemented, how usage is recorded, and specific reduction targets. See usage guidance for further information.
scope note: This metric is intended to capture detailed information on the energy conservation strategy in place but does not evaluate the success with which the strategy is implemented. Energy conservation refers to efforts made to reduce the amount of energy needed to execute current processes or tasks. Organizations should not include an overall reduction in energy consumption from reduced organizational activities (e.g., partial outsourcing of production). Details of energy conservation efforts to footnote include organizational or technological innovations that allow a defined process or task to consume energy more efficiently. These may include Building Area of Energy Efficiency Improvements (PI1586), conversion to renewable energy sources, or the elimination of unnecessary energy use due to changes in behavior. Further examples of energy efficiency efforts, sourced from GRESB, include: automatic meter readings (AMR), automation system upgrades/replacements, management systems upgrades/replacements, installation of high-efficiency equipment and appliances, installation of on-site renewable energy, occupier engagement/informational technologies, smart grid/smart building technologies, systems commissioning or retro-commissioning, wall/roof insulation, and window replacements. The reduction in the organization's energy usage may not necessarily correlate with a reduction in Greenhouse Gas (GHG) emissions; organizations are encouraged to report separately their Greenhouse Gas Emissions Strategy (OI8237), where applicable. Organizations are encouraged to report the amount of energy conserved using Energy Conserved (OI6697), as well as Energy Purchased: Total (OI8825) and its two categories, Energy Purchased: Non-Renewable (OI1496) and Energy Purchased: Renewable (OI3324).
defined by: giin

Permanent Employee Wages: Female
type: Concept
type: Code
has name: Permanent Employee Wages: Female
has description: Value of wages (including bonuses and excluding benefits) paid to all female full- and part-time employees of the organization during the reporting period.
definition: Value of wages (including bonuses and excluding benefits) paid to all female full- and part-time employees of the organization during the reporting period.
has identifier: OI4559
notation: OI4559
had primary source: OI4559
note: Organizations should footnote all assumptions used.
scope note: This metric is intended to capture pre-tax wages and salaries paid to the organization’s full- and part-time female employees and should include neither benefits nor payroll expenses. This metric should exclude Temporary Employee Wages (OI4202).
defined by: giin

Units/Volume Replaced
type: Concept
type: Code
has name: Units/Volume Replaced
has description: Number of status-quo products that were replaced by products sold during the reporting period.
definition: Number of status-quo products that were replaced by products sold during the reporting period.
has identifier: OI4564
notation: OI4564
had primary source: OI4564
note: Organizations should footnote all assumptions used, including source of data and nature of product replaced.
scope note: This metric is intended to capture the number of existing products replaced by products the organization sold during the reporting period. Organizations should select and report a single product type replaced. For example, for a solar lantern, organizations may report the product replaced as kerosene, lanterns, candles, battery torches, or generators. This metric may be estimated from a representative sample. When calculating the number of products replaced, organizations should consider the operating life of the replacement product. For example, a solar lantern, over its operating life, may replace hundreds of kerosene lanterns.
defined by: giin

Part-time Employees: Employees with Disabilities
type: Concept
type: Code
has name: Part-time Employees: Employees with Disabilities
has description: Number of paid, part-time employees with disabilities at the organization as of the end of the reporting period.
definition: Number of paid, part-time employees with disabilities at the organization as of the end of the reporting period.
has identifier: OI4571
notation: OI4571
had primary source: OI4571
note: Organizations should footnote all assumptions used, as well as any specific focus on stakeholders with particular disabilities.
scope note: This metric is intended to capture the number of unique individuals with disabilities employed by the organization in part-time roles as of the end of the reporting period. This metric excludes Temporary Employees (OI9028). This metric is multi-dimensional with regard to the five dimensions of impact: it may help describe the WHO dimension when the stakeholder group represented by the metric is the stakeholder group targeted by the investment or organization. It may also help measure the HOW MUCH Scale dimension, which helps estimate the number of the targeted stakeholders experiencing the outcome. For more on the alignment of IRIS metrics to the five dimensions of impact, see IRIS+ and the Five Dimensions of Impact (https://iris.thegiin.org/document/iris-and-the-five-dimensions/). No single metric is sufficient to understand an impact; rather, metrics are selected as a set across all dimensions of impact. When possible, the selection of metrics to measure and describe the five dimensions should be based on best practice and evidence.
defined by: giin

Business Innovation
type: Concept
type: Code
has name: Business Innovation
has identifier: OI4718
notation: OI4718
had primary source: OI4718
note: Organizations should footnote all assumptions used, including source(s) of data.
scope note: This metric is intended to capture the adoption or operationalization of innovative business practices, ranging from financial structuring of the organization to the business processes it uses to deliver its products and services, as well as innovation in products. Products captured under this metric can be both physical goods and financial products. “Operating geography and sector” can refer to a national market in small countries and regional markets in larger countries. Organizations are encouraged to footnote the type of innovation adopted or operationalized, as well as the rationale for such an adoption or operationalization being considered innovation. Innovations in supplier or client relationships are better covered by Market Linkages Improved or Expanded (OI0685). International Finance Institutions (IFIs) often use this metric as part of their analysis of private sector development.
has description: Describes whether the organization adopted or operationalized a product, internal process, technology, or financing structure that was new or not widely used in the operating geography and sector during the reporting period. In order to contextualize the innovation, specify whether it was previously available in the operating geography and sector, by Impact Category: Financial Services: - Yes, by non-predatory informal alternatives such as family, friends, and community savings groups - Yes, by predatory informal alternatives such as loan sharks - Yes, there are a few other formal alternatives, but the market is young and not saturated - Yes, it is a mature market with several other formal alternatives, but the market is not saturated - Yes, there are several other formal alternatives and the market presents high saturation risk - None, our investee is the sole provider Clean Energy: - Yes, there are several other clean, on-grid alternatives and the market presents high saturation risk - Yes, it is a mature market with several alternatives (both clean and dirty; on- and off-grid), but the market is not saturated - Yes, there are a few other clean energy alternatives, but the market is young and not saturated - Yes, by informal alternatives which tend to be non-renewable and off-grid - None, our investee is the sole provider Other: - Other (write-in)
definition: Describes whether the organization adopted or operationalized a product, internal process, technology, or financing structure that was new or not widely used in the operating geography and sector during the reporting period. In order to contextualize the innovation, specify whether it was previously available in the operating geography and sector, by Impact Category: Financial Services: - Yes, by non-predatory informal alternatives such as family, friends, and community savings groups - Yes, by predatory informal alternatives such as loan sharks - Yes, there are a few other formal alternatives, but the market is young and not saturated - Yes, it is a mature market with several other formal alternatives, but the market is not saturated - Yes, there are several other formal alternatives and the market presents high saturation risk - None, our investee is the sole provider Clean Energy: - Yes, there are several other clean, on-grid alternatives and the market presents high saturation risk - Yes, it is a mature market with several alternatives (both clean and dirty; on- and off-grid), but the market is not saturated - Yes, there are a few other clean energy alternatives, but the market is young and not saturated - Yes, by informal alternatives which tend to be non-renewable and off-grid - None, our investee is the sole provider Other: - Other (write-in)
defined by: giin

Employees Earning a Living Wage or Higher
type: Concept
type: Code
has name: Employees Earning a Living Wage or Higher
has description: Number of full-time, part-time, and temporary employees of the organization who are earning a local living wage or higher as of the end of the reporting period.
definition: Number of full-time, part-time, and temporary employees of the organization who are earning a local living wage or higher as of the end of the reporting period.
has identifier: OI4724
notation: OI4724
had primary source: OI4724
note: Organizations should footnote the local living wage for the region(s) in which they operate (since the living wage varies with geography), as well as the sources on which they rely for these data. See usage guidance for further information.
scope note: This metric is intended to capture the number of employees earning a local living wage or higher. According to the Corporate Human Rights Benchmark (CHRB) Methodology, a living wage is defined as enough to provide a decent living for a worker and their family based on a regular work week, not including overtime hours. A living wage is sufficient to cover food, water, clothing, transport, education, health care, and other essential needs for workers and their officially entitled dependents, along with some discretionary income. Workers should also receive equal pay for equal work. For more on this definition, see CHRB (https://www.corporatebenchmark.org/). Since the living wage varies with geography, IRIS+ does not define a living wage. However, the following resources are recommended for companies with workers located in Canada, Ireland, New Zealand, the United Kingdom, or the United States. Organizations with workers in other geographies may reference the Global Living Wage Coalition (https://www.globallivingwage.org) to find out if a living wage benchmark is available in that geography. - Living Wage Canada (http://livingwagecanada.ca) - Living Wage for Ireland (https://www.livingwage.ie) - Living Wage New Zealand (https://www.livingwage.org.nz/) - UK: Living Wage Foundation (http://www.livingwage.org.uk/calculation) - United States: MIT Living Wage Calculator (http://livingwage.mit.edu) All organizations should footnote the living wage levels they have used for this metric. This metric is multidimensional with regard to the five dimensions of impact. In some contexts, this metric can serve as an indicator of whether the outcome being sought by an investor or organization is occurring (the WHAT dimension of impact). This metric may also help describe the HOW MUCH Scale dimension, which helps estimate the number of the targeted stakeholders experiencing the outcome. For more on the alignment of IRIS metrics to the five dimensions of impact, see IRIS+ and the Five D…
defined by: giin

Social and Environmental Performance Reporting
type: Concept
type: Code
has name: Social and Environmental Performance Reporting
has description: Indicates whether the organization reports its social and environmental performance to relevant stakeholders.
definition: Indicates whether the organization reports its social and environmental performance to relevant stakeholders.
has identifier: OI4732
notation: OI4732
had primary source: OI4732
note: Organizations should footnote details on the types of performance reported, how relevant stakeholders are defined, and how the results of the report are disseminated. See usage guidance for further information.
scope note: This metric is intended to capture whether or not the organization reports its social and environmental performance. Examples of information that may be included in performance reports, to footnote, include: social and/or environmental metrics or outcomes (e.g., metric tons of carbon offset), targets related to the organization's social and/or environmental goals and progress against these goals, and third-party validation of the information shared, among other information. Examples of how the results of performance reporting may be disseminated, to footnote, include: disclosed privately or publicly, shared via the organization's national/regional/global networks, or published in the organization's annual report (sometimes sent, for instance, to a regulatory body). Organizations typically provide this information to relevant stakeholders annually and in the form of a report that allows comparison to past reporting periods. Organizations are also encouraged to footnote whether their performance reports are independently audited. Organizations are encouraged to report this metric in conjunction with Social and Environmental Targets (OD4091) and Social and Environmental Performance Risk Assessment (OI9106).
defined by: giin

Supplier Screening Policy
type: Concept
type: Code
has name: Supplier Screening Policy
has description: Indicates whether the organization has a written policy of evaluating supplier organizations based on their social and environmental performance and a system to monitor compliance with this policy.
definition: Indicates whether the organization has a written policy of evaluating supplier organizations based on their social and environmental performance and a system to monitor compliance with this policy.
has identifier: OI4739
notation: OI4739
had primary source: OI4739
note: Organizations should footnote the type of factors considered when evaluating supplier organizations. See usage guidance for further information.
scope note: This metric is intended to capture the organization’s policy on screening suppliers for social and environmental criteria. Criteria screened could include specific negative practices (e.g., no child labor, no negative environmental impacts) or positive practices (e.g., environmentally friendly manufacturing processes, excellent labor practices). Organizations should footnote which factors are considered. Many organizations may only screen significant supplier organizations or may screen less significant suppliers to a lesser extent. Organizations are encouraged to footnote how their screening policies differ between types of suppliers. Organizations are encouraged to report this metric in conjunction with Supplier Screening Ratio (PI3016).
defined by: giin

Client Protection Policy
type: Concept
type: Code
has name: Client Protection Policy
has description: Indicates whether the organization has a written policy for client protection and a system to monitor compliance with this policy.
definition: Indicates whether the organization has a written policy for client protection and a system to monitor compliance with this policy.
has identifier: OI4753
notation: OI4753
had primary source: OI4753
note: Organizations should footnote the relevant details of their client protection policy, including the types of client protection practices enforced and the systems in place for ensuring compliance. See usage guidance for further information.
scope note: This metric is intended to capture the organization’s policy on client protection, including market conduct rules and client protection regulation, whether created voluntarily or through government mandate. Examples of policy characteristics, to footnote, may include: whether the policy is written and publicized, details of the client protection practices outlined within the policy, whether the policy complies with regulatory requirements, and whether the organization endorses the Smart Campaign's client protection principles. Examples of client protection practices that may be captured in the policy include: codified organizational values and standards of professional conduct expected of all employees, integration of client protection standards into employee performance evaluations, design of products that are appropriate and do no harm to clients, avoidance of aggressive sales techniques and dangerous commercial practices, disclosure of full cost information, enforcement of clear and proactive communication with clients, and protection of client privacy, among others. Organizations can refer to the Smart Campaign's Client Protection Principles (www.smartcampaign.org) and the SPI4 (http://cerise-spi4.squarespace.com/) for additional indicators related to client protection. SPI4 is a social audit tool, developed for financial service providers, which can apply to any organization with both social and financial objectives.
defined by: giin

Greenhouse Gas Emissions Reduced
type: Concept
type: Code
has name: Greenhouse Gas Emissions Reduced
has description: Amount of greenhouse gas (GHG) emissions reduced by the organization during the reporting period.
definition: Amount of greenhouse gas (GHG) emissions reduced by the organization during the reporting period.
has identifier: OI4862
notation: OI4862
had primary source: OI4862
note: Organizations should footnote all assumptions used, including detailed information on calculation methodology. See usage guidance for further information.
scope note: This metric is intended to capture the total amount of greenhouse gas emissions that were reduced by the organization during the reporting period. This metric should be used in combination with Greenhouse Gas Emissions Mitigation Types (OI9839) in order to disaggregate the types of greenhouse gas emissions reductions as relevant to the organization's activities. Calculating greenhouse gas emissions reductions is a technical process. In calculating this metric, organizations should align with an accepted standard, such as the American Carbon Registry or Greenhouse Gas (GHG) Protocol. This metric is multi-dimensional with regard to the five dimensions of impact. In some contexts, this metric can serve as an indicator of whether the outcome being sought by an investor or organization is occurring (the WHAT dimension of impact). It may also help measure the HOW MUCH Scale dimension, which helps estimate the number of the targeted stakeholders experiencing the outcome. For more on the alignment of IRIS metrics to the five dimensions of impact, see specific guidance document. No single metric is sufficient to understand an impact; rather, metrics are selected as a set across all dimensions of impact. When possible, the selection of metrics to measure and describe the five dimensions should be based on best practice and evidence.
defined by: giin

Fair Career Advancement Policy
type: Concept
type: Code
has name: Fair Career Advancement Policy
has description: Indicates whether the organization has a written policy to support the fair and equitable progression and promotion of employees and a system to monitor compliance with this policy.
definition: Indicates whether the organization has a written policy to support the fair and equitable progression and promotion of employees and a system to monitor compliance with this policy.
has identifier: OI4884
notation: OI4884
had primary source: OI4884
note: Organizations should footnote details on how they determine the advancement of employees.
scope note: This metric is intended to capture the organization’s policy on fair career progression. Organizations are encouraged to align these policies with state or international standards. For example, the United States Equal Employment Commission (EEOC) prohibits any employer from making decisions about job assignments and promotions based on an employee's race, color, religion, sex (including gender identity, sexual orientation, and pregnancy), national origin, age (40 or older), disability, or genetic information. Organizations are encouraged to emphasize their fair career advancement policy on their websites or job advertisements.
defined by: giin

Caregivers Employed: Professionals
type: Concept
type: Code
has name: Caregivers Employed: Professionals
has description: Number of caregiver professionals with current licenses or certifications, based on local requirements, employed by the organization as of the end of the reporting period.
definition: Number of caregiver professionals with current licenses or certifications, based on local requirements, employed by the organization as of the end of the reporting period.
has identifier: OI4919
notation: OI4919
had primary source: OI4919
note: Organizations should footnote details about the types of caregiver professionals employed. See usage guidance for further information.
scope note: This metric is intended to capture the subset of employed caregivers who have received advanced degrees, trainings, and certifications. See glossary term for an explanation of the difference between caregivers and caregiver professionals. This metric is multi-dimensional with regard to the five dimensions of impact. It may help describe the WHO dimension when the stakeholder group represented by the metric is the stakeholder group targeted by the investment or organization. It may also help measure the HOW MUCH Scale dimension, which helps estimate the number of the targeted stakeholders experiencing the outcome. For more on the alignment of IRIS metrics to the five dimensions of impact, see IRIS+ and the Five Dimensions of Impact (https://iris.thegiin.org/document/iris-and-the-five-dimensions/). No single metric is sufficient to understand an impact; rather, metrics are selected as a set across all dimensions of impact. When possible, the selection of metrics to measure and describe the five dimensions should be based on best practice and evidence.
defined by: giin

Social and Environmental Performance Incentives
type: Concept
type: Code
has name: Social and Environmental Performance Incentives
has description: Indicates whether the organization implemented any employee incentive schemes related to social and/or environmental performance goals during the reporting period.
definition: Indicates whether the organization implemented any employee incentive schemes related to social and/or environmental performance goals during the reporting period.
has identifier: OI4953
notation: OI4953
had primary source: OI4953
note: Organizations should footnote the types of social performance indicators used to incentivize employees and details on which employees qualify. See usage guidance for further information.
scope note: This metric is intended to capture whether employee incentives take into account social and performance indicators. Examples of types of indicators to footnote include, among others, client retention or dropout rates, outreach to women, outreach to specified target markets, or results of client feedback systems, as well as the goal or target scheme implemented for these indicators. Examples of types of employee categories to footnote include, among others, top management, middle management, loan officers, and back-office employees.
defined by: giin

Working Hour Policy
type: Concept
type: Code
has name: Working Hour Policy
has description: Indicates whether the organization has policies in place to monitor, evaluate, and ensure appropriate working hours of employees, as well as a system to monitor compliance.
definition: Indicates whether the organization has policies in place to monitor, evaluate, and ensure appropriate working hours of employees, as well as a system to monitor compliance.
has identifier: OI4972
notation: OI4972
had primary source: OI4972
note: Organizations should footnote all assumptions made, including details around the policies and systems in place to ensure compliance. See usage guidance for further information.
scope note: This metric is intended to capture whether the organization has a policy in line with international norms in place to screen for appropriate working hours of employees, as well as a system to monitor compliance with that policy. Organizations may use this metric to screen for appropriate working hours at directly supported/financed enterprises or small and medium-size enterprise (SME) clients. Given complexity of measuring hours worked by employees of SME client organizations, checking for a policy in place is a good alternative. This metric is focused on employees’ working hours. For polices related to safety and working conditions of employees, refer to Worker Safety Policy (OI8001) Examples of relevant policy details to footnote include: the process in place to assess safety risks, the frequency with which the risks are assessed, and the training and equipment provided to mitigate these risks. Worker safety includes placing and maintaining the worker in an environment adapted to the worker's physiological and psychological capabilities, preventing health-related departures caused by working conditions, promoting and maintaining the physical, mental, and social well-being of workers in all occupations, and protecting workers from health risks resulting from working conditions. Organizations can refer to the SPI4 (<http://cerise-spi4.squarespace.com/>), specifically the Essential Practice 5a5, for additional indicators related to worker safety. SPI4 is a social audit tool developed for financial service providers but applicable to any organization that has both social and financial objectives. This metric aligns with GRI Disclosure 403-8: Workers covered by an occupational health and safety management system.
defined by: giin

Training Type
type: Concept
type: Code
has name: Training Type
has identifier: OI5044
notation: OI5044
had primary source: OI5044
note: Organizations should footnote all assumptions used.
scope note: This metric is intended to capture the types of trainings completed by individuals (for example, by workers, leadership, the board, or client individuals) during the reporting period. Racial equity trainings are defined as those that explicitly focus on race and/or racism as a major factor in economic and social disparities in order to increase understanding of racism and its connection to financial markets. Organizations are strongly encouraged to offer racial equity trainings (and many other types of trainings) in a series and on an ongoing basis—rather than in a single instance—in order to enable the reflection necessary for these to be successful. Further, while implicit bias trainings can form a useful part of antiracism trainings, such trainings should additionally aim to highlight both the systemic outcomes of implicit biases and actions that individuals and organizations can take to drive more equitable outcomes. For further guidance on racial equity trainings, see the Resources sections in the IRIS+ Racial Equity theme. This metric aligns with the Corporate Racial Equity Alliance’s (https://corporateracialequityalliance.org/) Investor Blueprint for Racial Equity and CEO Blueprint for Racial Equity (https://corporateracialequityalliance.org/2021-blueprint).
has description: Describes the types of trainings completed by individuals as a result of the organization's activities during the reporting period. Choose all that apply: - Enterprise or business development training - Vocational or technical training - Anti-harassment training - Racial equity training - General social and environmental performance training - Undisclosed
definition: Describes the types of trainings completed by individuals as a result of the organization's activities during the reporting period. Choose all that apply: - Enterprise or business development training - Vocational or technical training - Anti-harassment training - Racial equity training - General social and environmental performance training - Undisclosed
defined by: giin

Client Feedback System
type: Concept
type: Code
has name: Client Feedback System
has description: Indicates whether the organization implements a feedback system to solicit client feedback and has an established procedure and/or committee to receive and handle client feedback.
definition: Indicates whether the organization implements a feedback system to solicit client feedback and has an established procedure and/or committee to receive and handle client feedback.
has identifier: OI5049
notation: OI5049
had primary source: OI5049
note: Organizations should footnote details on the process and frequency by which they obtain and handle client feedback. See usage guidance for further information.
scope note: This metric is intended to capture whether the organization has a system for requesting and receiving feedback from clients. Feedback systems should be designed to capture positive feedback, questions, and complaints. Organizations can refer to the glossary for more information on feedback systems. Examples of relevant details to footnote may include information on the degree to which organizations' client feedback systems are active and effective, such as: how clients are informed of this system, the methods in place to ensure feedback reaches the appropriate employees, the protocol followed to address complaints, the average timeframe for resolution of complaints, and the existence of internal checks in place to assess whether complaints were resolved satisfactorily. Organizations should also footnote the frequency of clients’ use of the system over the reporting period. Examples of ways in which clients can be informed of these systems include: products with an email address or phone number for customer feedback listed on packaging, a feedback link displayed on a customer-facing website, and a customer feedback number on invoices or contract agreements. Organizations can refer to the SPI4 (http://cerise-spi4.squarespace.com/), specifically Essential Practice 4e3, for additional indicators related to complaint resolution systems. SPI4 is a social audit tool, developed for financial service providers, which can apply to any organization with both social and financial objectives.
defined by: giin

Biodegradable Materials
type: Concept
type: Code
has name: Biodegradable Materials
has description: Amount of biodegradable materials used in the organization’s products (including packaging) during the reporting period.
definition: Amount of biodegradable materials used in the organization’s products (including packaging) during the reporting period.
has identifier: OI5101
notation: OI5101
had primary source: OI5101
note: Organizations should footnote all assumptions used.
scope note: This metric is intended to capture the quantity of biodegradable material—material that is capable of decomposing under natural conditions—used in the organization’s products during the reporting period. In some contexts, this metric can serve as an indicator of whether the outcome being sought by an investor or organization is occurring (the WHAT dimension of impact). For more on the alignment of IRIS metrics to the five dimensions of impact, see IRIS+ and the Five Dimensions of Impact (https://iris.thegiin.org/document/iris-and-the-five-dimensions/). No single metric is sufficient to understand an impact; rather, metrics are selected as a set across all dimensions of impact. When possible, the selection of metrics to measure and describe the five dimensions should be based on best practice and evidence.
defined by: giin

Employee Policy Documentation
type: Concept
type: Code
has name: Employee Policy Documentation
has description: Describes the types of policy documentation that are provided to employees of the organization.
definition: Describes the types of policy documentation that are provided to employees of the organization.
has identifier: OI5102
notation: OI5102
had primary source: OI5102
note: Organizations should footnote the types of policy documentation provided to employees and describe how it is distributed to them. See usage guidance for further information.
scope note: This metric is intended to capture the scope of policy documentation provided to employees of the organization. Examples of the types of policy documentation provided to employees, to footnote, include: Employee Handbooks, Human Resources Policies, Discrimination/Harassment Policies, Freedom of Association Policies, and Codes of Ethics, among others. Examples of areas covered by Human Resources Policies may include: anti-harassment safeguards, benefits, disciplinary procedures and possible sanctions, exit formalities, freedom of association, grievance resolution, non-discrimination, provision of any collective bargaining agreements, safety at work, wages/salary scales, whistleblower policies, and working conditions (e.g., rights concerning overtime pay). Examples of areas protected by a Discrimination/Harassment Policy may include prohibition against discrimination or harassment based on gender, race, color, disability, political opinion, sexual orientation, age, or religion, among others. Organizations can refer to Anti-Discrimination Policy (OI9331) for additional information.
defined by: giin

Financial Statement Review
type: Concept
type: Code
has name: Financial Statement Review
has description: Indicates whether it is the organization's policy to produce financial statements that are verified annually by a certified independent auditor.
definition: Indicates whether it is the organization's policy to produce financial statements that are verified annually by a certified independent auditor.
has identifier: OI5164
notation: OI5164
had primary source: OI5164
note: Organizations should footnote details about the frequency of the audit and who conducts it.
scope note: This metric is intended to capture whether or not the organization has audited financial statements.
defined by: giin

Full-time Wages: Female Management
type: Concept
type: Code
has name: Full-time Wages: Female Management
has description: Value of wages (including bonuses and excluding benefits) paid to all full-time female management employees (managers) of the organization during the reporting period.
definition: Value of wages (including bonuses and excluding benefits) paid to all full-time female management employees (managers) of the organization during the reporting period.
has identifier: OI5247
notation: OI5247
had primary source: OI5247
note: Organizations should footnote how their organization defines management levels. See usage guidance for further information.
scope note: This metric is intended to capture pre-tax wages and salaries paid to the organization's female management employees and should include neither benefits nor payroll expenses. This metric should exclude Temporary Employee Wages (OI4202). Organizations can refer to the glossary for additional guidance on defining management. The composition of management varies with an organization's stage and type, but managers are generally responsible for setting objectives (defining goals for the group and deciding what work must be done to meet those goals), organizing (dividing work into manageable activities and selecting the right people to accomplish them), motivating and communicating (creating a team out of individuals through decisions on pay, promotion, and communications), measuring (establishing targets and interpreting and analyzing performance), and developing people.
defined by: giin

Caregivers Employed: Total
type: Concept
type: Code
has name: Caregivers Employed: Total
has description: Number of caregivers with current licenses, certifications, or trainings, based on local requirements, employed by the organization as of the end of the reporting period.
definition: Number of caregivers with current licenses, certifications, or trainings, based on local requirements, employed by the organization as of the end of the reporting period.
has identifier: OI5323
notation: OI5323
had primary source: OI5323
note: Organizations should footnote details about the types of caregivers employed. See usage guidance for further information.
scope note: In the health context, this metric is intended to capture the number of individuals employed who provide preventive, curative, rehabilitative, and promotional health services. Examples of caregivers include doctors, nurses, clinicians, and community health workers. Caregivers need not necessarily be certified or licensed. In the education context, this metric is intended to capture the number of individuals employed who provide care and learning opportunities to children, particularly in early childhood. Examples of caregivers in education include pre-kindergarten teachers and daycare providers, among others. This metric is multi-dimensional with regard to the five dimensions of impact. It may help describe the WHO dimension when the stakeholder group represented by the metric is the stakeholder group targeted by the investment or organization. It may also help measure the HOW MUCH Scale dimension, which helps estimate the number of the targeted stakeholders experiencing the outcome. For more on the alignment of IRIS metrics to the five dimensions of impact, see IRIS+ and the Five Dimensions of Impact (https://iris.thegiin.org/document/iris-and-the-five-dimensions/). No single metric is sufficient to understand an impact; rather, metrics are selected as a set across all dimensions of impact. When possible, the selection of metrics to measure and describe the five dimensions should be based on best practice and evidence.
defined by: giin

Land Directly Controlled: Total
type: Concept
type: Code
has name: Land Directly Controlled: Total
has description: Area of land directly controlled by the organization during the reporting period.
definition: Area of land directly controlled by the organization during the reporting period.
has identifier: OI5408
notation: OI5408
had primary source: OI5408
note: Organizations should footnote details about the nature of the direct control relationship and all assumptions used, including source of data. See usage guidance for further information.
scope note: The IRIS catalog differentiates between land that the organization directly controls and land that the organization indirectly controls. This metric is intended to capture the area of land that is under the organization's direct control. Direct control refers to land for which the organization controls land use through direct operation or management, including situations in which the organization's employees cultivate the land directly. Note that land ownership is not always equivalent to control. For example, where land is leased to another entity or individual to cultivate (e.g., a third-party manager), land is only directly controlled if the lease is accompanied by exhaustive criteria for land use. Such land-use criteria are often included in management plans and legal agreements that also incorporate sustainability principles and typically include termination provisions in the event of poor performance. To the extent that the third-party manager must make minimal, ad-hoc, and discretionary land-use decisions that fall outside the scope of the land-use criteria, the land may still be considered directly controlled by the organization.
defined by: giin

Full-time Employees: Hired
type: Concept
type: Code
has name: Full-time Employees: Hired
has description: Number of paid, full-time employees hired by the organization during the reporting period.
definition: Number of paid, full-time employees hired by the organization during the reporting period.
has identifier: OI5479
notation: OI5479
had primary source: OI5479
note: Organizations should footnote all assumptions used.
scope note: This metric is intended to capture the number of unique individuals hired by the organization into full-time roles during the last reporting period. This metric excludes Temporary Employees (OI9028). This metric is multi-dimensional with regard to the five dimensions of impact: it may help describe the WHO dimension when the stakeholder group represented by the metric is the stakeholder group targeted by the investment or organization. It may also help measure the HOW MUCH Scale dimension, which helps estimate the number of the targeted stakeholders experiencing the outcome. For more on the alignment of IRIS metrics to the five dimensions of impact, see IRIS+ and the Five Dimensions of Impact (https://iris.thegiin.org/document/iris-and-the-five-dimensions/). No single metric is sufficient to understand an impact; rather, metrics are selected as a set across all dimensions of impact. When possible, the selection of metrics to measure and describe the five dimensions should be based on best practice and evidence.
defined by: giin

Bulk Cargo Handled
type: Concept
type: Code
has name: Bulk Cargo Handled
has description: Volume of bulk cargo transported through a road, railway, port, or airport during the reporting period.
definition: Volume of bulk cargo transported through a road, railway, port, or airport during the reporting period.
has identifier: OI5490
notation: OI5490
had primary source: OI5490
note: Organizations should footnote all assumptions used, including source of data and specific means of transport.
scope note: This metric is intended to capture the volume of cargo in a particular market or context, which can help assess the productivity and efficiency of transport and logistics infrastructure. This metric is typically reported in metric tons, though other units of measure may be used and specified using Unit of Measure (PD1602). International Finance Institutions (IFIs) often use this metric as part of their transportation analysis.
defined by: giin

Importance of Outcome to Stakeholders
type: Concept
type: Code
has name: Importance of Outcome to Stakeholders
has description: Describes the value or importance of the outcome being sought by the intervention or investment from the perspective of those affected during the reporting period. Choose all that apply: - Very important - Somewhat important - Neutral - Not important - Do not know
definition: Describes the value or importance of the outcome being sought by the intervention or investment from the perspective of those affected during the reporting period. Choose all that apply: - Very important - Somewhat important - Neutral - Not important - Do not know
has identifier: OI5495
notation: OI5495
had primary source: OI5495
note: Organizations should footnote all assumptions used, including source of data.
scope note: This metric is intended to capture the level of importance the intended outcome has for the target stakeholder group. Understanding which outcomes matter to stakeholders can help enterprises and investors prioritize and tailor their efforts and optimize their impact. Organizations should report the methods used to collect stakeholder input (for example, sample surveys, focus groups, or interviews), the number of stakeholders who provided input, and the breakdown of stakeholders’ responses (for example, the percent of target stakeholders who responded "very important" compared to those who responded "somewhat important"). If the stakeholder is the planet, organizations should reference scientific evidence relevant to the activity or intervention. For additional guidance on evidentiary standards, refer to the NESTA Standards of Evidence (https://iris.thegiin.org/document/iris-and-nesta/). Organizations may use the IRIS metric Stakeholder Engagement (OI7914) to understand the mechanisms used to obtain input from stakeholders regarding the design, development, and delivery of products and services. This metric should be part of the measurement and description of the WHAT dimension of impact, as it helps describe how important the outcome is for affected stakeholders. For more on using IRIS+ to capture stakeholder voice, see IRIS+ and the Five Dimensions of Impact (https://iris.thegiin.org/document/iris-and-the-five-dimensions/). No single metric is sufficient to understand an impact; rather, metrics are selected as a set across all dimensions of impact. When possible, the selection of metrics to measure and describe the five dimensions should be based on best practice and evidence.
defined by: giin

Percent Charitable Donations
type: Concept
type: Code
has name: Percent Charitable Donations
has description: Percentage of the organization's revenue that was given as charitable donations during the reporting period.
definition: Percentage of the organization's revenue that was given as charitable donations during the reporting period.
has identifier: OI5552
notation: OI5552
had primary source: OI5552
note: Organizations should footnote all assumptions used. See usage guidance for further information.
scope note: This metric is intended to capture charitable donations given, not received, by the organization as a percentage of its revenue. Pricing discounts to nonprofits do not count as charitable donations; only free services are considered in-kind donations. Organizations can refer to definitions and usage guidance for Charitable Donations (FP3774) and Total Revenue (FP6510) for more guidance. Since organizational business models differ, some organizations (e.g., those with low profit margins) should also consider reporting this metric as a percentage of Net Income (FP1301) to provide additional context on the amount of charitable donations given.
defined by: giin

Total Personal Connectivity Devices
type: Concept
type: Code
has name: Total Personal Connectivity Devices
has description: Average number of connectivity devices utilized in each client household during the reporting period.
definition: Average number of connectivity devices utilized in each client household during the reporting period.
has identifier: OI5657
notation: OI5657
had primary source: OI5657
note: Organizations should footnote all assumptions, including source of data.
scope note: This metric is intended to capture the number of connectivity devices per client household during the reporting period. Organizations should include in this metric any digital device that allows individuals to call or message their social network and/or access the Internet.
defined by: giin

Percent Employee Ownership
type: Concept
type: Code
has name: Percent Employee Ownership
has description: Percentage of the organization that is owned by individuals who are employed by the organization (full- or part-time) as of the end of the reporting period.
definition: Percentage of the organization that is owned by individuals who are employed by the organization (full- or part-time) as of the end of the reporting period.
has identifier: OI5660
notation: OI5660
had primary source: OI5660
note: Organizations should footnote all assumptions used. See usage guidance for further information.
scope note: This metric is intended to capture employee equity and ownership of the organization, which can help evaluate the degree to which employees benefit from company profits. Organizations may use Percent Female Ownership (OI2840) and Percent Ownership by Historically Marginalized Groups (OI7194) to further explore company ownership by key groups. This metric is multidimensional with regard to the five dimensions of impact. In some contexts, this metric can serve as an indicator of whether the outcome being sought by an investor or organization is occurring (the WHAT dimension of impact). This metric may also help describe the HOW MUCH Scale dimension, which helps estimate the number of the targeted stakeholders experiencing the outcome. For more on the alignment of IRIS metrics to the five dimensions of impact, see IRIS+ and the Five Dimensions of Impact (https://iris.thegiin.org/document/iris-and-the-five-dimensions/). No single metric is sufficient to understand an impact; rather, metrics are selected as a set across all dimensions of impact. The selection of metrics to measure and describe the five dimensions should be based on best practice and evidence.
defined by: giin

Greenhouse Gas Emissions Scopes
type: Concept
type: Code
has name: Greenhouse Gas Emissions Scopes
has identifier: OI5732
notation: OI5732
note: Organizations should footnote all assumptions used, including source of data.
scope note: This metric is intended to capture the different types of greenhouse gas emissions reported. The Greenhouse Gas (GHG) Protocol, the most widely used international accounting tool to understand, quantify, and manage greenhouse gas emissions, categorizes direct and indirect emissions into three broad scopes. Scope 1/Direct GHG emissions are emissions from sources that are owned or controlled by the reporting entity. Scope 2/Indirect GHG emissions are emissions that result from the activities of the reporting entity but that occur at sources owned or controlled by another entity. Scope 3 GHG emissions are emitted directly and indirectly by actors across the organization's value chain. For more information on the GHG Protocol, organizations should refer to the following: - Greenhouse Gas Protocol Standards (http://www.ghgprotocol.org/standards) - Greenhouse Gas Protocol Calculators (https://ghgprotocol.org/calculation-tools) GHG emissions resulting from land use, changes in land use, bioenergy, and related topics can be reported in conjunction with indirect emissions across the organization's value chain. Organizations can use this metric in conjunction with Greenhouse Gas Emissions: Total (OI1479) to detail the GHG emissions for a specific scope. For GHG related to products, organizations may report Greenhouse Gas Emissions of Product (PD9427) and Greenhouse Gas Emissions of Product Replaced (PD2243).
had primary source: OI5732
has description: Describes the applicable types of greenhouse gases (GHG) emitted as a result of the organization's operations during the reporting period. Choose all that apply: - Scope 1/Direct Emissions (emissions from owned or controlled sources) - Scope 2/Indirect Emissions (emissions from purchased energy) - Scope 3/Indirect and direct emissions across the organization’s value chain
definition: Describes the applicable types of greenhouse gases (GHG) emitted as a result of the organization's operations during the reporting period. Choose all that apply: - Scope 1/Direct Emissions (emissions from owned or controlled sources) - Scope 2/Indirect Emissions (emissions from purchased energy) - Scope 3/Indirect and direct emissions across the organization’s value chain
defined by: giin

Loan Officer Wages
type: Concept
type: Code
has name: Loan Officer Wages
has description: Value of wages (including bonuses) paid to loan officers during the reporting period.
definition: Value of wages (including bonuses) paid to loan officers during the reporting period.
has identifier: OI5803
notation: OI5803
had primary source: OI5803
scope note: This metric is intended to capture the total wages paid by the organization to loan officers during the reporting period. For organizations providing insurance products, this metric should also include insurance agent wages.
defined by: giin

Employees Earning Minimum Wage
type: Concept
type: Code
has name: Employees Earning Minimum Wage
has description: Number of full-time, part-time, and temporary employees of the organization that are earning the local minimum wage as of the end of the reporting period.
definition: Number of full-time, part-time, and temporary employees of the organization that are earning the local minimum wage as of the end of the reporting period.
has identifier: OI5858
notation: OI5858
had primary source: OI5858
note: Organizations should footnote the minimum local wage for the region(s) in which they operate (since the minimum wage varies with geography), as well as the sources on which they rely for these data. See usage guidance for further information.
scope note: This metric is intended to capture the number of employees earning an exact local minimum wage. Minimum wage is the lowest wage permitted by law or by special agreement (such as with a labor union). Since the minimum wage varies with geography and context, IRIS does not define a minimum wage. Organizations can refer to the definition of minimum wage in the glossary for more resources on determining minimum wage(s) for the purposes of IRIS+ reporting. Organizations interested in capturing living wage may instead use Employees Earning a Living Wage or Higher (OI4724). This metric is multi-dimensional with regard to the five dimensions of impact. It may help describe the WHO dimension when the stakeholder group represented by the metric is the stakeholder group targeted by the investment or organization. It may also help measure the HOW MUCH Scale dimension, which helps estimate the number of the targeted stakeholders experiencing the outcome. For more on the alignment of IRIS metrics to the five dimensions of impact, see IRIS+ and the Five Dimensions of Impact (https://iris.thegiin.org/document/iris-and-the-five-dimensions/). No single metric is sufficient to understand an impact; rather, metrics are selected as a set across all dimensions of impact. When possible, the selection of metrics to measure and describe the five dimensions should be based on best practice and evidence.
defined by: giin

Full-time Wages: Total
type: Concept
type: Code
has name: Full-time Wages: Total
has description: Value of wages (including bonuses and excluding benefits) paid to all full-time employees of the organization during the reporting period.
definition: Value of wages (including bonuses and excluding benefits) paid to all full-time employees of the organization during the reporting period.
has identifier: OI5887
notation: OI5887
had primary source: OI5887
note: Organizations should footnote all assumptions used.
scope note: This metric is intended to capture pre-tax wages and salaries paid to the organization's full-time employees and should include neither benefits nor payroll expenses. This metric should exclude Temporary Employee Wages (OI4202).
defined by: giin

Teachers Employed
type: Concept
type: Code
has name: Teachers Employed
has description: Number of full- and part-time teachers employed by the organization as of the end of the reporting period.
definition: Number of full- and part-time teachers employed by the organization as of the end of the reporting period.
has identifier: OI5896
notation: OI5896
had primary source: OI5896
note: Organizations should footnote all assumptions used, as well as a breakdown of full- and part-time teachers.
scope note: This metric is intended to capture the number of teachers employed by the organization as of the end of the reporting period. This metric is multi-dimensional with regard to the five dimensions of impact. It may help describe the WHO dimension when the stakeholder group represented by the metric is the stakeholder group targeted by the investment or organization. It may also help measure the HOW MUCH Scale dimension, which helps estimate the number of the targeted stakeholders experiencing the outcome. For more on the alignment of IRIS metrics to the five dimensions of impact, see IRIS+ and the Five Dimensions of Impact (https://iris.thegiin.org/document/iris-and-the-five-dimensions/). No single metric is sufficient to understand an impact; rather, metrics are selected as a set across all dimensions of impact. When possible, the selection of metrics to measure and describe the five dimensions should be based on best practice and evidence.
defined by: giin

Biodiversity Assessment
type: Concept
type: Code
has name: Biodiversity Assessment
has description: Indicates whether the organization has undertaken biodiversity-related assessments to evaluate the biological diversity and ecosystem condition present on the land that is directly or indirectly controlled by the organization.
definition: Indicates whether the organization has undertaken biodiversity-related assessments to evaluate the biological diversity and ecosystem condition present on the land that is directly or indirectly controlled by the organization.
has identifier: OI5929
notation: OI5929
had primary source: OI5929
note: Organizations should footnote details about what the assessments evaluate. See usage guidance for further information.
scope note: This metric is intended to capture whether the organization completes any type of biodiversity measurement, from tailormade species inventories in the field to high-level modeling. Examples of information that such assessments may cover, which organizations should footnote, include: the species present in a given area, invasive species present, habitat conditions, overexploitation of natural resources, availability and quality of water resources, potential effect of production on adjacent crops, historical/archaeological importance of the land, impact of climate change or pollutions, or existence of regulations related to the site (e.g., catchments area, protected area). Organizations are also encouraged to footnote details about the frequency and system with which they conduct their biodiversity assessments. Various biodiversity measurement tools are available (for more information, see European Business & Biodiversity Platform’s workstream on methods, https://ec.europa.eu/environment/biodiversity/business/workstreams/methods/index_en.htm). Organizations are encouraged, albeit with caution, to embrace innovative measurement approaches to improve accuracy. Organizations are encouraged to report this metric alongside others in the Biodiversity IRIS+ Core Metrics Set, as tailored to context, that give a complementary, more complete picture of biodiversity performance. The level of application (e.g., project, site, or organization) and business context of the collected data will heavily inform the type of assessment performed. Examples of business context, to footnote, include screening on biodiversity risks, identifying restoration opportunities, tracking progress against targets (such as biodiversity no net loss or net gain), comparing investment options, and benchmarking.
defined by: giin

Toxic Materials
type: Concept
type: Code
has name: Toxic Materials
has description: Amount of toxic materials used in the organization's manufacturing processes during the reporting period.
definition: Amount of toxic materials used in the organization's manufacturing processes during the reporting period.
has identifier: OI5942
notation: OI5942
had primary source: OI5942
note: Organizations should footnote all assumptions used.
scope note: This metric is intended to capture the level of toxicity present in the organization’s manufacturing processes. Organizations are encouraged to align their reporting to international standards. For example, the European Union Regulation for Registration, Evaluation, Authorization, and Registration of Chemicals (REACH) requires companies to provide information across the industrial supply chain about the risks posed by substances, as well as how they should be handled. This information on the safe use of substances is transmitted along the industrial supply chain to help reduce risks for workers, consumers, and the planet.
defined by: giin

Greenhouse Gas Emissions Mitigated
type: Concept
type: Code
has name: Greenhouse Gas Emissions Mitigated
has description: Amount of greenhouse gas (GHG) emissions mitigated by the organization during the reporting period, including GHG emissions reductions from both direct and indirect sources.
definition: Amount of greenhouse gas (GHG) emissions mitigated by the organization during the reporting period, including GHG emissions reductions from both direct and indirect sources.
has identifier: OI5951
notation: OI5951
had primary source: OI5951
note: Organizations should footnote all assumptions used, including detailed information on calculation methodology and source of data. See usage guidance for further information.
scope note: This metric is intended to capture the total amount of GHG emissions mitigated during the reporting period: the sum of GHG emissions sequestered and avoided or reduced by the organization during the reporting period. To disaggregate by type of GHG emissions mitigation, organizations are encouraged to report Greenhouse Gas Emissions Mitigation Types (OI9839) and, as applicable, Greenhouse Gas Emissions Sequestered (PI9878) and Greenhouse Gas Emissions Avoided or Reduced (PI2764). All such metrics should include GHG emissions reductions from both direct and indirect sources. This metric should be a number representing the organization's total mitigation of carbon. To understand the organization's net carbon emittance, subtract this metric from Greenhouse Gas Emissions: Total (OI1479). This metric is multi-dimensional with regard to the five dimensions of impact. In some contexts, this metric can serve as an indicator of whether the outcome being sought by an investor or organization is occurring (the WHAT dimension of impact). It may also help measure the HOW MUCH Scale dimension, which helps estimate the number of the targeted stakeholders experiencing the outcome. For more on the alignment of IRIS metrics to the five dimensions of impact, see IRIS+ and the Five Dimensions of Impact (https://iris.thegiin.org/document/iris-and-the-five-dimensions/). No single metric is sufficient to understand an impact; rather, metrics are selected as a set across all dimensions of impact. When possible, the selection of metrics to measure and describe the five dimensions should be based on best practice and evidence.
defined by: giin

Greenhouse Gas Types
type: Concept
type: Code
has name: Greenhouse Gas Types
has identifier: OI6041
notation: OI6041
had primary source: OI6041
note: Organizations should footnote all assumptions used, including source of data.
scope note: This metric is intended to capture the type of greenhouse gas emissions produced or mitigated by the organization during the reporting period. To report in alignment with the GHG Protocol, Organizations are encouraged to use this metric in combination with Greenhouse Gas Emissions: Total (OI1479) and Greenhouse Gas Emissions Scopes (OI5732). For more information on the GHG Protocol, organizations should refer to the following: - Greenhouse Gas Protocol Standards (http://www.ghgprotocol.org/standards) - Greenhouse Gas Protocol Calculators (https://ghgprotocol.org/calculation-tools)
has description: Describes the type(s) of greenhouse gases produced or mitigated by the organization during the reporting period. Choose all that apply: - Carbon dioxide (CO2) - Methane (CH4) - Nitrous oxide (N2O) - Hydrofluorocarbons (HFCs) - Perfluorocarbons (PFCs) - Sulfur hexafluoride (SF6) - Carbon dioxide (CO2) directly emitted from biologically sequestered carbon - Undisclosed
definition: Describes the type(s) of greenhouse gases produced or mitigated by the organization during the reporting period. Choose all that apply: - Carbon dioxide (CO2) - Methane (CH4) - Nitrous oxide (N2O) - Hydrofluorocarbons (HFCs) - Perfluorocarbons (PFCs) - Sulfur hexafluoride (SF6) - Carbon dioxide (CO2) directly emitted from biologically sequestered carbon - Undisclosed
defined by: giin

Full-time Wages: Management
type: Concept
type: Code
has name: Full-time Wages: Management
has description: Value of wages (including bonuses and excluding benefits) paid to all full-time management employees (managers) of the organization during the reporting period.
definition: Value of wages (including bonuses and excluding benefits) paid to all full-time management employees (managers) of the organization during the reporting period.
has identifier: OI6069
notation: OI6069
had primary source: OI6069
note: Organizations should footnote how management levels are defined within their organization. See usage guidance for further information.
scope note: This metric is intended to capture pre-tax wages and salaries paid to the organization's management employees and should include neither benefits nor payroll expenses. This metric should exclude Temporary Employee Wages (OI4202). Organizations can refer to the glossary for additional guidance on defining management. The composition of management varies with an organization's stage and type, but managers are generally responsible for setting objectives (defining goals for the group and deciding what work must be done to meet those goals), organizing (dividing work into manageable activities and selecting the right people to accomplish them), motivating and communicating (creating a team out of individuals through decisions on pay, promotion, and communications), measuring (establishing targets and interpreting and analyzing performance), and developing people.
defined by: giin

Minimum Wage Multiple
type: Concept
type: Code
has name: Minimum Wage Multiple
has description: Ratio of the average wage of non-salaried, permanent (full- and part-time) employees of the organization during the reporting period compared to the local minimum wage as of the end of the reporting period.
definition: Ratio of the average wage of non-salaried, permanent (full- and part-time) employees of the organization during the reporting period compared to the local minimum wage as of the end of the reporting period.
has identifier: OI6176
notation: OI6176
had primary source: OI6176
note: Organizations should footnote details on the source from which the local minimum wage was determined. See usage guidance for further information.
scope note: This metric is intended to capture the average non-salaried wage paid to employees of the organization as a multiple of the local minimum wage during the reporting period. Organizations may use a variety of timeframes to calculate the average non-salaried wage (such as hourly, weekly, or daily) and should use the same time period when comparing wages to the local minimum. For example, if the minimum wage in a given area is based on an hourly rate, the average wage should also be hourly. Organizations should footnote the source of the local minimum wage used to calculate this ratio. Organizations can refer to the definition of minimum wage in the glossary for more resources on where to find minimum wages by various geographies. Organizations are encouraged to narrow the calculation of this ratio to specific geographies, industries, departments, or positions, and organizations should footnote details on how the calculation was done. In some contexts, this metric can serve as an indicator of whether the outcome being sought by an investor or organization is occurring (the WHAT dimension of impact). For more on the alignment of IRIS metrics to the five dimensions of impact, see IRIS+ and the Five Dimensions of Impact (https://iris.thegiin.org/document/iris-and-the-five-dimensions/). No single metric is sufficient to understand an impact; rather, metrics are selected as a set across all dimensions of impact. When possible, the selection of metrics to measure and describe the five dimensions should be based on best practice and evidence.
defined by: giin

Waste Disposed: Total
type: Concept
type: Code
has name: Waste Disposed: Total
has description: Amount of waste disposed by the organization during the reporting period.
definition: Amount of waste disposed by the organization during the reporting period.
has identifier: OI6192
notation: OI6192
had primary source: OI6192
note: Organizations should footnote all assumptions used, including the type(s) of waste disposed.
scope note: This metric is intended to capture the amount of waste disposed safely by the organization during the reporting period. Organizations may consult local, national, and international regulations and guidelines on the disposal of waste to ensure safety measures are incorporated and implemented. In some contexts, this metric can serve as an indicator of whether the outcome being sought by an investor or organization is occurring (the WHAT dimension of impact). For more on the alignment of IRIS metrics to the five dimensions of impact, see IRIS+ and the Five Dimensions of Impact (https://iris.thegiin.org/document/iris-and-the-five-dimensions/). No single metric is sufficient to understand an impact; rather, metrics are selected as a set across all dimensions of impact. When possible, the selection of metrics to measure and describe the five dimensions should be based on best practice and evidence.
defined by: giin

Product Lifecycle Management Practices
type: Concept
type: Code
has name: Product Lifecycle Management Practices
has description: Indicates whether the organization has practices in place to manage products over their life beyond the point of sale.
definition: Indicates whether the organization has practices in place to manage products over their life beyond the point of sale.
has identifier: OI6209
notation: OI6209
had primary source: OI6209
note: Organizations should footnote the details about their product lifecycle management practices. See usage guidance for further information.
scope note: This metric is intended to capture whether an organization manages the environmental footprint of their product(s) beyond the point of sale and throughout their life. Product lifecycle management relates to the principle of a circular economy: an economy that is restorative by design and which aims to maintain products, components, and materials at their highest utility and value. Examples of product lifecycle practices to footnote could include the following: - Product take-back, including reclaiming used products from end-consumers for redistribution (following refurbishment or remanufacturing), recycling, or safe disposal. - Reuse programs involving redistribution initiatives to underserved populations, subject to state or local laws. - Product/service design intended to prolong durability or to rely on circular inputs (such as reusable materials or renewable energy). - Investments in technology that enables circular business models. - Product recycling that returns recovered biological resources to the biosphere and extracts biochemicals from organic waste. Organizations can refer to the following sources for further guidance: - Ellen MacArthur Foundation: Circular Economy (http://www.ellenmacarthurfoundation.org/circular-economy/circular-economy) - International Organization for Standardization (ISO) 14040:2006 (http://www.iso.org/iso/catalogue_detail?csnumber=37456)
defined by: giin

Full-time Employees: Female
type: Concept
type: Code
has name: Full-time Employees: Female
has description: Number of paid, full-time, female employees at the organization as of the end of the reporting period.
definition: Number of paid, full-time, female employees at the organization as of the end of the reporting period.
has identifier: OI6213
notation: OI6213
had primary source: OI6213
note: Organizations should footnote all assumptions used.
scope note: This metric is intended to capture the number of unique, female individuals employed by the organization in full-time roles as of the end of the reporting period. This metric excludes Temporary Employees (OI9028). To report in line with 2X Challenge requirements, organizations should disaggregate among direct, indirect, and supplier employees, as relevant in context. 2X Challenge defines these as follows: - Direct workforce: Share of women directly employed by the investee organization. - Contracted workers: Share of women among third-party workers engaged to perform work related to core business processes for a substantial duration. - Supply chain: Share of women among investee’s primary supplier workforce. If the corresponding proportion of primary suppliers meet entrepreneurship or senior management criteria, this may also justify 2X eligibility. Organizations may also use Supplier Individuals: Total (PI5350) and Supplier Individuals: Female (PI1728) to capture the supply chain disaggregation. This metric is multi-dimensional with regard to the five dimensions of impact: it may help describe the WHO dimension when the stakeholder group represented by the metric is the stakeholder group targeted by the investment or organization. It may also help measure the HOW MUCH Scale dimension, which helps estimate the number of the targeted stakeholders experiencing the outcome. For more on the alignment of IRIS metrics to the five dimensions of impact, see IRIS+ and the Five Dimensions of Impact (https://iris.thegiin.org/document/iris-and-the-five-dimensions/). No single metric is sufficient to understand an impact; rather, metrics are selected as a set across all dimensions of impact. When possible, the selection of metrics to measure and describe the five dimensions should be based on best practice and evidence.
defined by: giin

Recycling Policy
type: Concept
type: Code
has name: Recycling Policy
has description: Indicates whether the organization implements a recycling policy in its operating facilities.
definition: Indicates whether the organization implements a recycling policy in its operating facilities.
has identifier: OI6286
notation: OI6286
had primary source: OI6286
note: Organizations should footnote details regarding their recycling policy and how it is being implemented. See usage guidance for further information.
scope note: This metric is intended to capture detailed information on the recycling policy in place but does not evaluate the success with which that policy is implemented. Examples of relevant details to footnote include: items recycled (e.g., paper, cardboard, plastic, glass, metal, water), frequency of pickup, type of processing facility, and baseline type of waste processing (where would the waste have gone otherwise, such as waste-to-energy or landfill). Organizations are encouraged to report this metric in conjunction with Waste Reduced (OI7920). Organizations can refer to the following sources for further guidance on implementing their recycling policy: - United States Environmental Protection Agency (http://www2.epa.gov/recycle/recycling-basics) - National Recycling Coalition (http://nrcrecycles.org/learn-3/) - International Organization for Standardization (http://www.iso.org/iso/home/standards/management-standards/iso14000.htm)
defined by: giin

Employees Dedicated to Social and Environmental Performance
type: Concept
type: Code
has name: Employees Dedicated to Social and Environmental Performance
has description: Number of full-time equivalent employees dedicated to managing social and environmental performance during the reporting period.
definition: Number of full-time equivalent employees dedicated to managing social and environmental performance during the reporting period.
has identifier: OI6370
notation: OI6370
had primary source: OI6370
note: Organizations should footnote all assumptions used, including the local definition of full-time employment.
scope note: This metric is intended to capture the number of employees managing an organization’s social and environmental performance. In calculating the number of full-time equivalent jobs (FTEs), organizations should convert part-time jobs to full-time equivalent jobs on a pro rata basis, based on local definitions. (For instance, if the standard working week equals 40 hours, a 20 hour/week job would be equal to 0.5 FTEs). In this calculation, organizations should also consider the share of employees’ duties allocated to managing social and environmental performance. For instance, if an organization had 4 full-time employees working on social and environmental performance issues each for half of their work time, they would report 2 FTEs under this metric. This metric is multi-dimensional with regard to the five dimensions of impact: it may help describe the WHO dimension when the stakeholder group represented by the metric is the stakeholder group targeted by the investment or organization. It may also help measure the HOW MUCH Scale dimension, which helps estimate the number of the targeted stakeholders experiencing the outcome. For more on the alignment of IRIS metrics to the five dimensions of impact, see IRIS+ and the Five Dimensions of Impact (https://iris.thegiin.org/document/iris-and-the-five-dimensions/). No single metric is sufficient to understand an impact; rather, metrics are selected as a set across all dimensions of impact. When possible, the selection of metrics to measure and describe the five dimensions should be based on best practice and evidence.
defined by: giin

Soil Conservation Practices
type: Concept
type: Code
has name: Soil Conservation Practices
has identifier: OI6381
notation: OI6381
had primary source: OI6381
note: Organizations should footnote all assumptions used, including descriptions of soil health practices and methods used, their frequency of application, description of soil health characteristics, and details of nutrient management plans.
scope note: This metric is intended to capture the practices the organization employs to conserve soil and reduce erosion. This metric aligns with the Leading Harvest (https://www.leadingharvest.org/standard) Performance Measure 2.2 on Soil Conservation. Practices that may be relevant to this measure, depending on geography and context, include crop rotation, livestock rotation, composting, no-till farming, cover crops, agroforestry, intercropping, use of live barriers, and other techniques. Organizations may find the three conservation agriculture principles (http://conservationagriculture.mannlib.cornell.edu/pages/aboutca/whatisca.html) and the Farmer Managed Natural Regeneration (FMNR) Manual (https://fmnrhub.com.au/fmnr-manual/) to be helpful resources.
has description: Indicates which soil conservation practices the organization implemented during the reporting period. Select all that apply: - Application of regionally appropriate practices to minimize disturbance of and physical damage to soil, cropland, and pasturelands - Prevention of soil erosion, acidification, salinization, and accumulation of adverse compounds not otherwise specified - Other (describe)
definition: Indicates which soil conservation practices the organization implemented during the reporting period. Select all that apply: - Application of regionally appropriate practices to minimize disturbance of and physical damage to soil, cropland, and pasturelands - Prevention of soil erosion, acidification, salinization, and accumulation of adverse compounds not otherwise specified - Other (describe)
defined by: giin

Indigenous Rights and Stewardship Practices
type: Concept
type: Code
has name: Indigenous Rights and Stewardship Practices
has description: Describes the practices used by the organization to acknowledge and support the traditional knowledge, innovations, and practices of local Indigenous communities and enable their customary use of biological resources on land, freshwater, and marine areas managed directly and indirectly by the organization.
definition: Describes the practices used by the organization to acknowledge and support the traditional knowledge, innovations, and practices of local Indigenous communities and enable their customary use of biological resources on land, freshwater, and marine areas managed directly and indirectly by the organization.
has identifier: OI6482
notation: OI6482
had primary source: OI6482
note: Organizations should footnote all assumptions used as well as the degree to which the organization partners with local Indigenous people to conduct business activities.
scope note: This metric is intended to describe whether and how the organization acknowledges and supports the traditional knowledge, innovations and practices of Indigenous and local communities relevant for the conservation and sustainable use of biodiversity, and their customary use of biological resources, subject to national legislation and relevant international obligations. This metric is based on and references Convention on Biological Diversity’s Aichi Target 18. For further detail, see “TARGET 18 - Technical Rationale Extended” (https://www.cbd.int/sp/targets/rationale/target-18/). Organizations may also find the following resources useful in reporting against this metric: - First Nations Development Institute's Stewarding Native Lands Reading List (https://www.firstnations.org/stewarding-native-lands-resources/) - “Creating a Sustainable World: A Guide to Responsible Stewardship of American Indian Assets” (https://www.ussif.org/files/Publications/TribalAssets.pdf) - “Aichi Target 18 beyond 2020: mainstreaming Traditional Biodiversity Knowledge in the conservation and sustainable use of marine and coastal ecosystems (https://www.ncbi.nlm.nih.gov/pmc/articles/PMC7852408/) - IFC’s Performance Standard 7 (https://www.ifc.org/wps/wcm/connect/topics_ext_content/ifc_external_corporate_site/sustainability-at-ifc/policies-standards/performance-standards/ps7#:~:text=Indigenous%20Peoples%20(2012)&text=PS7%20seeks%20to%20ensure%20that,benefits%20in%20culturally%20appropriate%20ways)
defined by: giin

Part-time Employees: Historically Marginalized
type: Concept
type: Code
has name: Part-time Employees: Historically Marginalized
has description: Number of paid, part-time employees at the organization who belong to groups historically marginalized on the basis of race and/or ethnicity as of the end of the reporting period.
definition: Number of paid, part-time employees at the organization who belong to groups historically marginalized on the basis of race and/or ethnicity as of the end of the reporting period.
has identifier: OI6508
notation: OI6508
had primary source: OI6508
note: Organizations should footnote all assumptions used, including their categorization of historically marginalized groups. See usage guidance for further information.
scope note: This metric is intended to capture the number of unique individuals who belong to groups historically marginalized on the basis of race and/or ethnicity and who are employed by the organization in part-time roles as of the end of the reporting period. This metric excludes Temporary Employees (OI9028). The categorization of historically marginalized groups varies with location and context. With no internationally agreed-upon definition as to which groups constitute historically marginalized on the basis of race and/or ethnicity, if well-established local policies exist (as in South Africa, with the Broad Based Black Economic Empowerment [BBBEE] definition of historically marginalized, or in India, based on backward caste), organizations should refer to these local guidelines to identify groups historically marginalized on the basis of race and/or ethnicity. Otherwise, and wherever appropriate, organizations should provide additional detail regarding their tailored methodology for defining these groups. This metric is multi-dimensional with regard to the five dimensions of impact: it may help describe the WHO dimension when the stakeholder group represented by the metric is the stakeholder group targeted by the investment or organization. It may also help measure the HOW MUCH Scale dimension, which helps estimate the number of the targeted stakeholders experiencing the outcome. For more on the alignment of IRIS metrics to the five dimensions of impact, see IRIS+ and the Five Dimensions of Impact (https://iris.thegiin.org/document/iris-and-the-five-dimensions/). No single metric is sufficient to understand an impact; rather, metrics are selected as a set across all dimensions of impact. When possible, the selection of metrics to measure and describe the five dimensions should be based on best practice and evidence.
defined by: giin

Occupational Fatalities
type: Concept
type: Code
has name: Occupational Fatalities
has description: Indicates the number of occupational fatalities of full-time, part-time, and temporary employees of the organization during the reporting period.
definition: Indicates the number of occupational fatalities of full-time, part-time, and temporary employees of the organization during the reporting period.
has identifier: OI6525
notation: OI6525
had primary source: OI6525
note: Organizations should footnote details about each occupational fatality, as well as plans on how to prevent similar fatalities in the future.
scope note: This metric is intended to capture the number of occupational fatalities at the organization during the reporting period. An occupational fatality occurs if an event or exposure results in the fatal injury or illness of a person, either on the employer's premises while the person was there to work or off the employer's premise while the person was there to work (or if the event/exposure was related to the person's work or status as an employee). Organizations can refer to the following sources for additional guidance: - United States Department of Labor, Bureau of Labor Statistics (http://www.bls.gov/iif/oshcfdef.htm) - International Labour Organization, Safety and Health statistics (http://www.ilo.org/global/statistics-and-databases/statistics-overview-and-topics/safety-and-health/lang--en/index.htm)
defined by: giin

Board of Directors: Historically Marginalized
type: Concept
type: Code
has name: Board of Directors: Historically Marginalized
has description: Number of members of the board of directors or other governing body as of the end of the reporting period who belong to groups historically marginalized on the basis of race and/or ethnicity.
definition: Number of members of the board of directors or other governing body as of the end of the reporting period who belong to groups historically marginalized on the basis of race and/or ethnicity.
has identifier: OI6696
notation: OI6696
had primary source: OI6696
note: Organizations should footnote their categorization of historically marginalized groups. See usage guidance for further information.
scope note: This metric is intended to capture representation by people from groups historically marginalized on the basis of race and/or ethnicity on the organization’s board of directors. A board of directors is a group of individuals legally responsible to govern a corporation and responsible to the shareholders and other relevant stakeholders. A governing body with a different name (e.g., "advisory body") may be considered a Board of Directors provided it has a fiduciary and/or social responsibility to shareholders and/or other relevant stakeholders. The categorization of historically marginalized groups varies with location and context. With no internationally agreed-upon definition as to which groups constitute historically marginalized on the basis of race and/or ethnicity, if well-established local policies exist (as in South Africa, with the Broad Based Black Economic Empowerment [BBBEE] definition of historically marginalized, or in India, based on backward caste), organizations should refer to these local guidelines to identify groups historically marginalized on the basis of race and/or ethnicity. Otherwise, and wherever appropriate, organizations should provide additional detail regarding their tailored methodology for defining these groups. This metric is multi-dimensional with regard to the five dimensions of impact. It may help describe the WHO dimension when the stakeholder group represented by the metric is the stakeholder group targeted by the investment or organization. It may also help measure the HOW MUCH Scale dimension, which helps estimate the number of the targeted stakeholders experiencing the outcome. For more on the alignment of IRIS metrics to the five dimensions of impact, see IRIS+ and the Five Dimensions of Impact (https://iris.thegiin.org/document/iris-and-the-five-dimensions/). No single metric is sufficient to understand an impact; rather, metrics are selected as a set across all dimensions of impact. When possible, the selection of metrics t…
defined by: giin

Energy Conserved
type: Concept
type: Code
has name: Energy Conserved
has description: Amount of reduction in energy consumption achieved as a direct result of energy conservation and efficiency initiatives undertaken by the organization during the reporting period.
definition: Amount of reduction in energy consumption achieved as a direct result of energy conservation and efficiency initiatives undertaken by the organization during the reporting period.
has identifier: OI6697
notation: OI6697
had primary source: OI6697
note: Organizations should footnote the details on energy conservation techniques, type of energy conserved, and all assumptions used, including source of data. See usage guidance for further information.
scope note: This metric is intended to capture the amount of energy saved by the organization through specific energy-efficiency improvements. Improvements can result from energy-efficient construction/renovation investments within the organization’s operations or by reducing the amount of energy needed to carry out the same processes or tasks. This metric is not intended to capture reduced energy consumption that results from reduced organizational activities (e.g., partial outsourcing). Organizations should footnote the types of energy-conservation techniques employed (e.g., process redesign) and the types of energy reduced (e.g., fuel, electricity, steam). Organizations should footnote all assumptions used, including the basis for calculating reductions in energy consumption (such as base year or baseline) and the rationale for choosing that basis. For example, if the reporting period is annual, organizations should report on the difference in energy consumption between the current year and previous year. Additionally, organizations are encouraged to footnote energy conserved as a percentage of the total energy consumed by the organization. Organizations are encouraged to report this metric in conjunction with Energy Generated for Use: Total (OI9624), Energy Purchased: Total (OI8825), and Energy Conservation Strategy (OI4531). In some contexts, this metric may help measure the HOW MUCH Depth dimension of impact, which helps estimate the degree of change in outcome that the stakeholders experienced. For more on the alignment of IRIS metrics to the five dimensions of impact, see IRIS+ and the Five Dimensions of Impact (https://iris.thegiin.org/document/iris-and-the-five-dimensions/). No single metric is sufficient to understand an impact; rather, metrics are selected as a set across all dimensions of impact. When possible, the selection of metrics to measure and describe the five dimensions should be based on best practice and evidence.
defined by: giin

Waste Produced: Total
type: Concept
type: Code
has name: Waste Produced: Total
has description: Amount of waste created by the organization's operations during the reporting period.
definition: Amount of waste created by the organization's operations during the reporting period.
has identifier: OI6709
notation: OI6709
had primary source: OI6709
note: Organizations should footnote all assumptions used, including the type(s) of waste produced.
scope note: This metric is intended to capture the amount of waste the organization’s operations produced during the reporting period. In some contexts, this metric can serve as an indicator of whether the outcome being sought by an investor or organization is occurring (the WHAT dimension of impact). For more on the alignment of IRIS metrics to the five dimensions of impact, see IRIS+ and the Five Dimensions of Impact (https://iris.thegiin.org/document/iris-and-the-five-dimensions/). No single metric is sufficient to understand an impact; rather, metrics are selected as a set across all dimensions of impact. When possible, the selection of metrics to measure and describe the five dimensions should be based on best practice and evidence.
defined by: giin

Water Consumed: Rainwater
type: Concept
type: Code
has name: Water Consumed: Rainwater
has description: Volume of rainwater used for the organization's operations during the reporting period.
definition: Volume of rainwater used for the organization's operations during the reporting period.
has identifier: OI6721
notation: OI6721
had primary source: OI6721
note: Organizations should footnote all assumptions used.
scope note: This metric is intended to capture the volume of rainwater used within the organization for any purpose, including but not limited to productive processes (for example, packaging and manufacturing), human consumption, and agricultural purposes. This metric, as well as other metrics calculated using Water Withdrawn (OI0263) and Water Discharged (OI0386), can be used in conjunction with Water Type (OD7536) to describe water consumption in more detail. For further guidance on water uses, see the Alliance for Water Efficiency (http://www.allianceforwaterefficiency.org). In some contexts, this metric can serve as an indicator of whether the outcome being sought by an investor or organization is occurring (the WHAT dimension of impact). For more on the alignment of IRIS metrics to the five dimensions of impact, see IRIS+ and the Five Dimensions of Impact (https://iris.thegiin.org/document/iris-and-the-five-dimensions/). No single metric is sufficient to understand an impact; rather, metrics are selected as a set across all dimensions of impact. When possible, the selection of metrics to measure and describe the five dimensions should be based on best practice and evidence.
defined by: giin

Green Building Practices
type: Concept
type: Code
has name: Green Building Practices
has description: Indicates whether the organization employs green building practices.
definition: Indicates whether the organization employs green building practices.
has identifier: OI6765
notation: OI6765
had primary source: OI6765
note: Organizations should footnote the specific green building practices employed and details on the sustainability certifications, ratings, and labeling schemes received. See usage guidance for further information.
scope note: This metric is intended to capture the organization’s green building practices. Examples of practices to footnote may include energy-saving strategies (e.g., energy use monitoring, efficient appliances and lighting, renewable energy use), systems for increasing water efficiency (e.g., water-efficient appliances, fixtures, and landscaping), systems to monitor and improve air quality (e.g., increased ventilation, access to natural daylight), and use of sustainable materials (e.g., reclaimed products), among others. Certifications to footnote may include LEED certification or LEED equivalent certification. Organizations can refer to the glossary for additional information on green buildings. Organizations are encouraged to report this metric in conjunction with Renewable Energy Capital Expenditures (OI9206). Organizations can also report this metric in conjunction with Energy Conserved (OI6697), Water Conserved (OI4015), or Waste Reduced (OI7920) to capture the quantitative effects of the green building practices they have employed.
defined by: giin

Greenhouse Gas Emissions Avoided Due to Carbon Offsets Purchased
type: Concept
type: Code
has name: Greenhouse Gas Emissions Avoided Due to Carbon Offsets Purchased
has description: Amount of greenhouse gas (GHG) emissions avoided through carbon offsets purchased during the reporting period.
definition: Amount of greenhouse gas (GHG) emissions avoided through carbon offsets purchased during the reporting period.
has identifier: OI6774
notation: OI6774
had primary source: OI6774
note: Organizations should footnote relevant details on the carbon offsets purchased, along with the assumptions and methodologies used in calculating the emissions avoided. See usage guidance for further information.
scope note: This metric is intended to capture greenhouse gas emissions avoided through carbon credits purchased during the reporting period. The same data captured through this metric can also be captured through a combination of Greenhouse Gas Emissions Mitigation Types (OI9839) and Greenhouse Gas Emissions Avoided or Reduced (PI2764). In some contexts, this metric can serve as an indicator of whether the outcome being sought by an investor or organization is occurring (the WHAT dimension of impact). For more on the alignment of IRIS metrics to the five dimensions of impact, see IRIS+ and the Five Dimensions of Impact (https://iris.thegiin.org/document/iris-and-the-five-dimensions/). No single metric is sufficient to understand an impact; rather, metrics are selected as a set across all dimensions of impact. When possible, the selection of metrics to measure and describe the five dimensions should be based on best practice and evidence.
defined by: giin

Land Directly Controlled: Sustainably Managed
type: Concept
type: Code
has name: Land Directly Controlled: Sustainably Managed
has description: Area of land directly controlled by the organization and under sustainable cultivation or sustainable stewardship. Report directly controlled land area sustainably managed during the reporting period.
definition: Area of land directly controlled by the organization and under sustainable cultivation or sustainable stewardship. Report directly controlled land area sustainably managed during the reporting period.
has identifier: OI6912
notation: OI6912
had primary source: OI6912
note: Organizations should footnote details about the nature of the direct control relationship and all assumptions used, including source of data. See usage guidance for further information.
scope note: The IRIS catalog differentiates between land that the organization directly controls and land that the organization indirectly controls. This metric is intended to capture the area of land that is under the organization's direct control. Direct control refers to land for which the organization controls land use through direct operation or management, including situations in which the organization's employees cultivate the land directly. Note that land ownership is not always equivalent to control. For example, where land is leased to another entity or individual to cultivate (e.g., a third-party manager), land is only directly controlled if the lease is accompanied by exhaustive criteria for land use. Such land-use criteria are often included in management plans and legal agreements that also incorporate sustainability principles and typically include termination provisions in the event of poor performance. To the extent that the third-party manager must make minimal, ad-hoc, and discretionary land-use decisions that fall outside the scope of the land-use criteria, the land may still be considered directly controlled by the organization. Sustainability, in a broad sense, includes sustainable working conditions for employees responsible for land management, resource exploitation that guarantees the continuous delivery of ecosystem services for current and future generations, and even land that has been put under strict no-deforestation requirements. If, for example, a third party manages land under a lease contract, contract conditions and clauses should specify required management, exploitation, ethics, techniques, and conditions of contract termination. The organization should footnote details of these contracts and monitor whether the third party meets the requirements.
defined by: giin

Temporary Employees: Female
type: Concept
type: Code
has name: Temporary Employees: Female
has description: Number of female temporary employees paid by the organization during the reporting period.
definition: Number of female temporary employees paid by the organization during the reporting period.
has identifier: OI6978
notation: OI6978
had primary source: OI6978
note: Organizations should footnote all assumptions used, including details of the type of temporary employment provided. See usage guidance for further information.
scope note: This metric is intended to capture the number of temporary female employees who worked for the organization at any point during the reporting period. For example, if an employee worked at some point during the reporting period but was not employed as of the end of the reporting period, such an individual should be counted under this metric. Temporary employees include contracted (or subcontracted) employees, whether their contracts are written or oral; in any case, temporary employment is characterized by a predefined term: fixed-term contracts, project- or task-based contracts, and seasonal, intermittent, or casual work. Relevant details to footnote regarding the type of temporary employment provided could include, among other things, the typical duration of temporary employees’ contracts and the breakdown between full- and part-time temporary employees. Organizations are encouraged to report this metric in conjunction with Temporary Employee Hours Worked (OI8408). This metric is multi-dimensional with regards to the five dimensions of impact: it may help describe the WHO dimension when the stakeholder group represented by the metric is the stakeholder group targeted by the investment or organization. It may also help measure the HOW MUCH Scale dimension, which helps estimate the number of the targeted stakeholders experiencing the outcome. For more on the alignment of IRIS metrics to the five dimensions of impact, see IRIS+ and the Five Dimensions of Impact (https://iris.thegiin.org/document/iris-and-the-five-dimensions/). No single metric is sufficient to understand an impact; rather, metrics are selected as a set across all dimensions of impact. When possible, the selection of metrics to measure and describe the five dimensions should be based on best practice and evidence.
defined by: giin

Employees Promoted: Total
type: Concept
type: Code
has name: Employees Promoted: Total
has description: Number of permanent employees who were promoted from within the organization during the reporting period.
definition: Number of permanent employees who were promoted from within the organization during the reporting period.
has identifier: OI6995
notation: OI6995
had primary source: OI6995
note: Organizations should footnote all assumptions used.
scope note: This metric is intended to capture the number of unique individuals promoted by the organization during the reporting period and who were in full- or part-time roles as of the end of the reporting period. This metric excludes Temporary Employees (OI9028). Organizations are encouraged to footnote in which roles and levels employees promoted began and ended the reporting period. Promotion (or career advancement) is defined as the movement of an employee who already works for the organization to a higher grade level either within the same department or to another department as a result of a change in duties, not a market adjustment in salary. For more, see the Society for Human Resource Management (https://www.shrm.org/resourcesandtools/tools-and-samples/policies/pages/job-posting-policy---staff-promotions.aspx). This metric is multi-dimensional with regard to the five dimensions of impact. It may help describe the WHO dimension when the stakeholder group represented by the metric is the stakeholder group targeted by the investment or organization. It may also help measure the HOW MUCH Scale dimension, which helps estimate the number of the targeted stakeholders experiencing the outcome. For more on the alignment of IRIS metrics to the five dimensions of impact, see IRIS+ and the Five Dimensions of Impact (https://iris.thegiin.org/document/iris-and-the-five-dimensions/). No single metric is sufficient to understand an impact; rather, metrics are selected as a set across all dimensions of impact. When possible, the selection of metrics to measure and describe the five dimensions should be based on best practice and evidence.
defined by: giin

Occupational Illnesses
type: Concept
type: Code
has name: Occupational Illnesses
has description: Number of occupational illnesses which affected any full-time, part-time, or temporary employees of the organization during the reporting period.
definition: Number of occupational illnesses which affected any full-time, part-time, or temporary employees of the organization during the reporting period.
has identifier: OI7060
notation: OI7060
had primary source: OI7060
note: Organizations should footnote all assumptions used.
scope note: This metric is intended to capture the number of work-related illnesses arising from exposure to hazards at work. If the same employee experienced more than one occupational illness, each instance of illness should be counted. This metric is sourced from GRI Disclosure 403-10: Work-related Ill Health in GRI 403: Occupational Health and Safety 2018. Per GRI guidance, ‘Ill health’ indicates damage to health and includes diseases, illnesses, and disorders. The terms ‘disease,’ ‘illness,’ and ‘disorder,’ often used interchangeably, refer to conditions with specific symptoms and diagnoses. Work-related injuries and ill health are those that arise from exposure to hazards at work. Other types of incidents can occur that are not connected with the work itself. For more guidance, see GRI Disclosure 403-10 (https://www.globalreporting.org/standards/media/1910/gri-403-occupational-health-and-safety-2018.pdf).
defined by: giin

Permanent Employee Wages: Low-Income Areas
type: Concept
type: Code
has name: Permanent Employee Wages: Low-Income Areas
has description: Value of wages (including bonuses and excluding benefits) paid to all full- and part-time employees of the organization who reside in low-income areas during the reporting period.
definition: Value of wages (including bonuses and excluding benefits) paid to all full- and part-time employees of the organization who reside in low-income areas during the reporting period.
has identifier: OI7064
notation: OI7064
had primary source: OI7064
note: Organizations should footnote details on the assessment tools used to identify low-income employees. See usage guidance for further information.
scope note: This metric is intended to capture pre-tax wages and salaries paid to the organization’s full- and part-time employees who reside in low-income areas and should include neither benefits nor payroll expenses. This metric should exclude Temporary Employee Wages (OI4202). The population classified as low income includes all those who fall below a fixed threshold, which includes those classified as poor or very poor. Because assessing the poverty level of employees is complex, organizations will likely use specific assessment tools to accurately report on this metric. See the glossary definition for additional information on commonly used tools to help determine the absolute poverty level of individuals and households.
defined by: giin

Number of Containers Handled
type: Concept
type: Code
has name: Number of Containers Handled
has description: Number twenty-foot equivalent units (TEUs) of cargo containers transported by a road, railway, port, or airport during the reporting period.
definition: Number twenty-foot equivalent units (TEUs) of cargo containers transported by a road, railway, port, or airport during the reporting period.
has identifier: OI7065
notation: OI7065
had primary source: OI7065
note: Organizations should footnote all assumptions used, including source of data and specific means of transport.
scope note: This metric is intended to capture the volume of transportation in a particular market or context, which can help assess the productivity and efficiency of transport and logistics infrastructure. For example, this metric could capture whether, as result of an investment, a port is able to boost its productivity by increasing the number of twenty-foot equivalent units (TEU) handled per hour. TEU are equivalent to a standard-size shipping container. Transportation of goods may be by rail, road, air, or sea. International Finance Institutions (IFIs) often use this metric as part of their transportation analysis.
defined by: giin

Percent Ownership by Historically Marginalized Groups
type: Concept
type: Code
has name: Percent Ownership by Historically Marginalized Groups
has description: Percentage of the organization that is owned, as of the end of the reporting period, by individuals who belong to groups historically marginalized due to race and/or ethnicity.
definition: Percentage of the organization that is owned, as of the end of the reporting period, by individuals who belong to groups historically marginalized due to race and/or ethnicity.
has identifier: OI7194
notation: OI7194
had primary source: OI7194
note: Organizations should footnote their categorization of historically marginalized groups and all other assumptions used. See usage guidance for further information.
scope note: This metric is intended to capture the percentage of company shares that are owned by individuals from groups historically marginalized due to race and/or ethnicity. Where regional or local laws apply for calculating ownership by historically marginalized groups, reporting should be consistent with these laws. Where such laws do not exist, shares that are publicly traded or owned by institutions cannot contribute to the number of shares owned by historically marginalized groups. The categorization of groups historically marginalized due to race and/or ethnicity varies with location and context. With no internationally agreed-upon definition as to which groups constitute minorities, if well-established local policies exist (as in South Africa, with the Broad Based Black Economic Empowerment [BBBEE] definition of historically marginalized, or in India, based on backward caste), organizations should refer to these local guidelines to identify groups historically marginalized due to race and/or ethnicity. Otherwise, and wherever appropriate, organizations should provide additional detail regarding their tailored methodology for defining these groups.
defined by: giin

Departed Permanent Employees: Involuntary
type: Concept
type: Code
has name: Departed Permanent Employees: Involuntary
has description: Number of full- and part-time employees who departed the organization involuntarily during the reporting period.
definition: Number of full- and part-time employees who departed the organization involuntarily during the reporting period.
has identifier: OI7225
notation: OI7225
had primary source: OI7225
note: Organizations should footnote all assumptions used.
scope note: This metric is intended to capture the number of involuntary departures from the organization, defined as those employees dismissed for cause, including the elimination of a position. This metric is multi-dimensional with regard to the five dimensions of impact: it may help describe the WHO dimension when the stakeholder group represented by the metric is the stakeholder group targeted by the investment or organization. It may also help measure the HOW MUCH Scale dimension, which helps estimate the number of the targeted stakeholders experiencing the outcome. For more on the alignment of IRIS metrics to the five dimensions of impact, see IRIS+ and the Five Dimensions of Impact (https://iris.thegiin.org/document/iris-and-the-five-dimensions/). No single metric is sufficient to understand an impact; rather, metrics are selected as a set across all dimensions of impact. When possible, the selection of metrics to measure and describe the five dimensions should be based on best practice and evidence.
defined by: giin

Water Quality Practices
type: Concept
type: Code
has name: Water Quality Practices
has description: Indicates whether the organization employs management practices to protect water quality.
definition: Indicates whether the organization employs management practices to protect water quality.
has identifier: OI7365
notation: OI7365
had primary source: OI7365
note: Organizations should footnote the specific details of their water quality practices.
scope note: This metric is intended to capture whether the organization employs practices to protect the quality of the water it uses. Organizations wishing to report strategies to reduce the quantity of water used should report Water Conservation Strategy (OI9326). Organizations should footnote practices employed on, for example, agricultural land over which they have direct control. See glossary definition of directly controlled (land area) for more information. Organizations can report this metric in conjunction with Land Directly Controlled: Total (OI5408) and related submetrics. Examples of water quality practices, to footnote, include the creation of buffer zones (particularly for native species); responsible management of manure, sewage, and fertilizer; and water-quality assessment.
defined by: giin

Employee Training Costs
type: Concept
type: Code
has name: Employee Training Costs
has description: Value of the costs incurred by the organization as a result of training provided to employees (full-time, part-time, or temporary) during the reporting period.
definition: Value of the costs incurred by the organization as a result of training provided to employees (full-time, part-time, or temporary) during the reporting period.
has identifier: OI7390
notation: OI7390
had primary source: OI7390
note: Organizations should footnote all assumptions used.
scope note: This metric is intended to capture funds spent by the organization to train its employees during the reporting period. These costs should not include salary or payroll expenses that are incurred during training hours. Training costs vary widely depending on the level of services provided to participants, whether or not an organization has staff dedicated to engaging employer networks, the level of need in the community where the program is located (greater need requires more outreach), or provision of financial support to participants. These factors can make comparisons of employee training costs across organizations difficult, if not accompanied by additional metrics that specify the level of services provided and level of local need. This metric aligns with SASB HC0101-15: Average training and development expenditure per full time employee.
defined by: giin

Pesticide Hazard Classification Type
type: Concept
type: Code
has name: Pesticide Hazard Classification Type
has description: Describes the pesticide hazard classification for pesticides used by the organization, or disaggregates another metric in terms of pesticide hazard classification. Select all that apply: - Class Ia Extremely hazardous - Class Ib Highly hazardous - Class II Moderately hazardous - Class III Slightly hazardous - Class U Unlikely to present acute hazard
definition: Describes the pesticide hazard classification for pesticides used by the organization, or disaggregates another metric in terms of pesticide hazard classification. Select all that apply: - Class Ia Extremely hazardous - Class Ib Highly hazardous - Class II Moderately hazardous - Class III Slightly hazardous - Class U Unlikely to present acute hazard
has identifier: OI7394
notation: OI7394
had primary source: OI7394
scope note: This metric is intended to capture the hazard classification of pesticides used by the organization on land directly or indirectly managed. For further guidance on hazard classification, see the World Health Organization’s “The WHO Recommended Classification of Pesticides by Hazard and Guidelines to Classification 2019” (https://apps.who.int/iris/bitstream/handle/10665/332193/9789240005662-eng.pdf).
defined by: giin

Charitable Practices
type: Concept
type: Code
has name: Charitable Practices
has description: Indicates whether the organization employs charitable practices in its operations.
definition: Indicates whether the organization employs charitable practices in its operations.
has identifier: OI7421
notation: OI7421
had primary source: OI7421
note: Organizations should footnote details about the types of charitable practices in place. See usage guidance for further information.
scope note: This metric is intended to capture whether the organization engages in charitable practices. Types of charitable practices, to footnote, may include: contributions of charitable donations to the local areas in which the organization operates or from which it sources; public-facing partnerships with service or charitable organizations; provision of facilities for community events or trainings; provision of trainings for organization's employees to serve in external leadership positions (e.g., on nonprofit Boards of Directors); and provision for paid employee volunteer time. Organizations are encouraged to report this metric in conjunction with Charitable Donations (FP3774). Organizations can also report this metric in conjunction with Community Service Hours Contributed (OI8429), if applicable.
defined by: giin

Waste Produced: Non-Hazardous Waste
type: Concept
type: Code
has name: Waste Produced: Non-Hazardous Waste
has description: Amount of non-hazardous waste created by the organization's operations during the reporting period.
definition: Amount of non-hazardous waste created by the organization's operations during the reporting period.
has identifier: OI7442
notation: OI7442
had primary source: OI7442
note: Organizations should footnote all assumptions used.
scope note: This metric is intended to capture the amount of non-hazardous waste the organization’s operations produced during the reporting period. To report the amount of hazardous waste produced, organizations can report Waste Produced: Hazardous Waste (OI1346). Non-hazardous waste presents no dangers to the environment in terms of contamination or pollution, with definitions varying with local legislation. In some contexts, this metric can serve as an indicator of whether the outcome being sought by an investor or organization is occurring (the WHAT dimension of impact). For more on the alignment of IRIS metrics to the five dimensions of impact, see IRIS+ and the Five Dimensions of Impact (https://iris.thegiin.org/document/iris-and-the-five-dimensions/). No single metric is sufficient to understand an impact; rather, metrics are selected as a set across all dimensions of impact. When possible, the selection of metrics to measure and describe the five dimensions should be based on best practice and evidence.
defined by: giin

Land Directly Controlled: Impervious Surfaces
type: Concept
type: Code
has name: Land Directly Controlled: Impervious Surfaces
has description: Area of land directly controlled by the organization that is impervious to water during the reporting period.
definition: Area of land directly controlled by the organization that is impervious to water during the reporting period.
has identifier: OI7560
notation: OI7560
had primary source: OI7560
note: Organizations should footnote all assumptions used, including source(s) of data.
scope note: This metric is intended to capture the area of land directly controlled by the organization that is covered by surfaces that do not allow water (particularly stormwater) to flow through the surface and into the ground. Examples of impervious surfaces include streets, roofs, parking lots, walkways, or any other surfaces and structures made of asphalt, concrete, plastics, or similar materials. In developed-market contexts, organizations may source these data from existing maps. For example, in the United States, see the National Map (https://nationalmap.gov/small_scale/mld/impe100.html). In emerging-market contexts, free satellite mapping tools (such as Google Earth) can be used to create a map of roads as a starting point for these data. For a more detailed map, third-party technical support may be necessary.
defined by: giin

Value of Fines and Settlements
type: Concept
type: Code
has name: Value of Fines and Settlements
has description: Value of payments made by the organization as legal or regulatory fines and settlements during the reporting period.
definition: Value of payments made by the organization as legal or regulatory fines and settlements during the reporting period.
has identifier: OI7639
notation: OI7639
had primary source: OI7639
note: Organizations should footnote the number of fines and settlements, as well as a description of the types of fines paid and actions that were taken to prevent them from being incurred in the future. See usage guidance for further information.
scope note: This metric is intended to capture the value of legal or regulatory fines and settlements paid by the organization during the reporting period. Depending on the category in which the organization operates, fines could be associated with (but not limited to) any of these: -Bribery or corruption, including violations of the US Foreign Corrupt Practices Act (FCPA) or UK Bribery Act -Data security breaches -Diversity and equal opportunity -Cartel activities, price fixing, anti-trust activities -Consumer privacy -Environmental violations -Employee safety or workplace conditions -False, deceptive, or unfair advertising -False marketing claims -Federal pipeline and storage regulations -Financial reporting inaccuracies -Labor law violations -Land rights disputes -Libel or slander -Money laundering -Tax evasion Organizations should consider reporting this metric in conjunction with Number of Legal and Regulatory Complaints (OI2165).
defined by: giin

Social Responsibility Client Policies
type: Concept
type: Code
has name: Social Responsibility Client Policies
has description: Indicates whether the organization implements policies to protect its clients.
definition: Indicates whether the organization implements policies to protect its clients.
has identifier: OI7783
notation: OI7783
had primary source: OI7783
note: Organizations should footnote details on the types of policies implemented. See usage guidance for further information.
scope note: This metric can be used by many different types of organizations. Examples of policies that a financial service organization might have in place to protect its clients may include: - All employees involved in collections are trained on collection practices and in particular on acceptable and unacceptable debt collection practices which are clearly spelled out in a code of ethics, book of employee rules, or debt collection manual. - Internal audits check household debt exposure, lending practices that violate procedures including unauthorized refinancing, multiple borrowers or co-signers per household, and other practices that could increase indebtedness. - Productivity targets and incentive systems value portfolio quality at least as highly as other factors, such as disbursement or customer growth. Growth is rewarded only if portfolio quality is high. - The institution's collection practices are covered during the initial training of all employees involved in collections (loan officers, collections employees, and branch managers). In particular, collections employees receive training in acceptable debt collections practices and loan recovery procedures. - The institution documents and communicates to clients about loan policies and procedures for rescheduling credit. - The institution's prepayment penalties, account closure fees, transaction fees, or other penalties are not excessive. - The organization has a culture that values and rewards high standards of ethical behavior and customer service. - Other
defined by: giin

Investment Committee Members: Total
type: Concept
type: Code
has name: Investment Committee Members: Total
has description: Number of members of the organization's investment committee as of the end of the reporting period.
definition: Number of members of the organization's investment committee as of the end of the reporting period.
has identifier: OI7829
notation: OI7829
had primary source: OI7829
note: Organizations should footnote all assumptions used.
scope note: This metric is intended to capture the number of members of an investment committee, the governing body charged with overseeing investments and developing investment policies for board approval. Most, but not all investor organizations have investment committees. If the organization does not have a formalized investment committee, organizations should apply this metric to whatever group of individuals that makes investment decisions. This metric, reported along with Target Stakeholder Demographic (PD5752) to specify historically marginalized groups due to race and/or ethnicity, aligns with the Corporate Racial Equity Alliance’s (https://corporateracialequityalliance.org/) Investor Blueprint for Racial Equity. This metric is multi-dimensional with regard to the five dimensions of impact. It may help describe the WHO dimension when the stakeholder group represented by the metric is the stakeholder group targeted by the investment or organization. It may also help measure the HOW MUCH Scale dimension, which helps estimate the number of the targeted stakeholders experiencing the outcome. For more on the alignment of IRIS metrics to the five dimensions of impact, see IRIS+ and the Five Dimensions of Impact (https://iris.thegiin.org/document/iris-and-the-five-dimensions/). No single metric is sufficient to understand an impact; rather, metrics are selected as a set across all dimensions of impact. When possible, the selection of metrics to measure and describe the five dimensions should be based on best practice and evidence.
defined by: giin

Wastewater Treatment Compliance
type: Concept
type: Code
has name: Wastewater Treatment Compliance
has description: Indicates whether the organization's practices related to the discharge of wastewater comply with local legal requirements.
definition: Indicates whether the organization's practices related to the discharge of wastewater comply with local legal requirements.
has identifier: OI7860
notation: OI7860
had primary source: OI7860
note: Organizations should footnote the specific details of their wastewater management policies and any details regarding violation of local compliance.
scope note: This metric is intended to capture an organization's adherence to local and national wastewater-treatment standards and requirements.
defined by: giin

Marine Area Directly Controlled: Total
type: Concept
type: Code
has name: Marine Area Directly Controlled: Total
has description: Area of marine environment directly controlled by the organization during the reporting period.
definition: Area of marine environment directly controlled by the organization during the reporting period.
has identifier: OI7876
notation: OI7876
had primary source: OI7876
note: Organizations should footnote all assumptions used, including source(s) of data.
scope note: This metric is intended to capture the area of marine environment directly controlled by the organization during the reporting period. See the IRIS Glossary definition on “Directly Controlled” (https://iris.thegiin.org/glossary/) for further detail. Datasets on important marine and coastal habitats and species can be applied to support decisions during biodiversity risk screening or to identify conservation and restoration opportunities. The Ocean Data Viewer by Ocean+ (see https://data.unep-wcmc.org/ and https://oceanplus.org/) includes various spatial datasets, such as the distribution of coral reefs, mangroves, and seagrasses, as well as distribution of marine mammals and even feeding and nesting sites for marine turtles. Note that species abundance typically changes over multiple years or even decades.
defined by: giin

Employee Training Hours
type: Concept
type: Code
has name: Employee Training Hours
has description: Number of training hours provided for employees (full-time, part-time, or temporary) during the reporting period.
definition: Number of training hours provided for employees (full-time, part-time, or temporary) during the reporting period.
has identifier: OI7877
notation: OI7877
had primary source: OI7877
note: Organizations should footnote the types of training provided, particularly those that lead to recognized certifications.
scope note: This metric is intended to capture the sum of all training hours provided to employees. It is not intended to capture the average number of training hours per employee. Trainings may include both internal and external opportunities provided by the organization. Training can be categorized as: (a) skills-based training to advance core job responsibilities (enhancing employees' ability to do their jobs effectively); (b) skills-based training on cross-job functions (training beyond regular job responsibilities, enabling employees' to advance in their professions); (c) training on literacy, communications, and other life skills; or (d) trainings related to diversity and inclusion (for example, training on implicit bias or sexual harassment). Organizations should footnote details on the training(s) provided, including the type. This metric is useful in calculating GRI Disclosure 404-1: Average hours of training per year per employee. In the context of this GRI standard, ‘training’ refers to all types of vocational training and instruction, paid educational leave provided by an organization for its employees, training or education pursued externally and paid for in whole or in part by an organization, and training on specific topics. Training does not include on-site coaching by supervisors. Organizations may use Full-Time Employees: Total (OI3160) and Part-Time Employees: Total (OI8864) to disaggregate this metric. Organizations are also encouraged to calculate this indicator for Temporary Employees (OI9028). Organizations may choose to use Target Stakeholder Demographic (PD5752) to disaggregate this metric by gender, race/ethnicity, disability, or other groupings.
defined by: giin

Stakeholder Engagement
type: Concept
type: Code
has name: Stakeholder Engagement
has identifier: OI7914
notation: OI7914
had primary source: OI7914
note: Organizations should footnote at which stages (e.g., concept development, product design) stakeholders were engaged, how they were engaged, and whether they were compensated for their engagement.
scope note: This metric is intended to capture the ways in which the organization engages target stakeholders in the design, development, and delivery of product and service offerings. Target stakeholder (or client) engagement strategies involve intentional approaches to align the design and provision of products and services with the priorities of target stakeholders. A target stakeholder can be a client, employee, or anyone the organization is aiming to positively impact. Some organizations call a target stakeholder a ‘beneficiary.’ Organizations aiming to engage communities may consider using Community Engagement Strategy (OI2319). Organizations can refer to the following sources for further guidance on stakeholder engagement: - World Economic Forum: Engaging All Affected Stakeholders into Investments and Activities of Organizations (https://impactmanagementproject.com/wp-content/uploads/Guidance-on-engaging-all-affected-stakeholders.pdf) - Feedback Labs: Is Feedback Smart? (https://feedbacklabs.org/smart-thing/) - Social Performance Task Force: Universal standards for Social Performance Measurement (https://sptf.info/images/USSPM-Manual-English-v2.0-Nov2016.pdf) - Social Value International: Principles of Social Value (https://socialvalueint.org/social-value/principles-of-social-value/) - User Voice: Putting People at the Heart of Impact Practice (https://www.thinknpc.org/resource-hub/user-voice-putting-people-at-the-heart-of-impact-practice/) - Make It Count: Why Impact Matters in User Involvement (https://www.thinknpc.org/resource-hub/make-it-count-why-impact-matters-in-user-involvement/)
has description: Describes the mechanisms in place to gather input from stakeholders on product/service design, development, and delivery. Select all that apply: - Identify community need(s), if any, in collaboration with target stakeholders - Consult with target stakeholders about their needs when developing strategy - Collect impact data from stakeholders via interviews and/or surveys - Work with investees to reflect target stakeholders' perspectives in product/service offerings - Monitor target stakeholder satisfaction - None - Other (describe)
definition: Describes the mechanisms in place to gather input from stakeholders on product/service design, development, and delivery. Select all that apply: - Identify community need(s), if any, in collaboration with target stakeholders - Consult with target stakeholders about their needs when developing strategy - Collect impact data from stakeholders via interviews and/or surveys - Work with investees to reflect target stakeholders' perspectives in product/service offerings - Monitor target stakeholder satisfaction - None - Other (describe)
defined by: giin

Waste Reduced
type: Concept
type: Code
has name: Waste Reduced
has description: Amount of waste reduced by the organization during the reporting period through programs for substitution, recycling, or recovery.
definition: Amount of waste reduced by the organization during the reporting period through programs for substitution, recycling, or recovery.
has identifier: OI7920
notation: OI7920
had primary source: OI7920
note: Organizations should footnote all assumptions used.
scope note: This metric is intended to capture waste reductions achieved strictly through the organization's operations. Organizations wishing to report on waste reductions achieved through the sale of products should report Waste Reductions from Products Sold (PI5926). Organizations wishing to report on waste reductions achieved through the provision of services should report Waste Reductions from Services Sold (PI5678). Waste reduction through organizational operations may include efforts to reduce (i.e., using fewer inputs), reuse (e.g., repurposing rather than disposing or recycling excess inputs or unwanted outputs), or recycle (e.g., through established systems or through on-site processing) material or energy.
defined by: giin

Flexible Work Arrangements
type: Concept
type: Code
has name: Flexible Work Arrangements
has description: Indicates whether the organization offers flexible work arrangements to full-time, part-time, or temporary employees of the organization.
definition: Indicates whether the organization offers flexible work arrangements to full-time, part-time, or temporary employees of the organization.
has identifier: OI7983
notation: OI7983
had primary source: OI7983
note: Organizations should footnote details of the flexible arrangements offered and their uptake. See usage guidance for further information.
scope note: This metric is intended to capture whether the organization offers flexible work arrangements to employees. Examples of flexible work arrangements to footnote may include choosing work shift, choosing flexible working hours (allowing freedom to vary start and stop times), working from remote locations (telecommuting), and job-sharing, among other options (footnote additional details).
defined by: giin

Worker Safety Policy
type: Concept
type: Code
has name: Worker Safety Policy
has description: Indicates whether the organization has policies in place to monitor, evaluate, and ensure worker safety.
definition: Indicates whether the organization has policies in place to monitor, evaluate, and ensure worker safety.
has identifier: OI8001
notation: OI8001
had primary source: OI8001
note: Organizations should footnote details around these policies, including the practices in place to ensure compliance. See usage guidance for further information.
scope note: This metric is intended to capture whether the organization has created policies in line with international norms to protect the safety of its workers. Worker safety entails placing and maintaining the worker in an environment adapted to the worker's physiological and psychological capabilities; preventing health-related departures caused by working conditions; promoting and maintaining the physical, mental, and social well-being of workers in all occupations; and protecting workers from health risks resulting from working conditions. Examples of relevant policy details to footnote include: the process in place to assess safety risks, the frequency with which these risks are assessed, and the training and equipment provided to mitigate these risks. Examples of training and equipment provided to mitigate worker safety risks include: safety training, required protective gear, testing of equipment, and posting of signs. Organizations can refer to the SPI4 (http://cerise-spi4.squarespace.com/), specifically Essential Practice 5a5, for additional indicators related to worker safety. SPI4 is a social audit tool, developed for financial service providers, which can apply to any organization with both social and financial objectives. This metric aligns with GRI Disclosure 403-8: Workers covered by an occupational health and safety management system.
defined by: giin

Water Consumed: Surface Water
type: Concept
type: Code
has name: Water Consumed: Surface Water
has description: Volume of surface water used for the organization's operations during the reporting period.
definition: Volume of surface water used for the organization's operations during the reporting period.
has identifier: OI8060
notation: OI8060
had primary source: OI8060
note: Organizations should footnote all assumptions used.
scope note: This metric is intended to capture the volume of surface water used within the organization for any purpose, including but not limited to productive processes (for example, packaging and manufacturing), human consumption, and agricultural purposes. Surface water occurs naturally on the Earth’s surface in the form of ice sheets, ice caps, glaciers, icebergs, bogs, ponds, lakes, rivers, and streams. For further details, see the IRIS+ glossary term. This metric applies to organizations sourcing their water directly from an above-ground water body rather than from a water service provider. This metric, as well as other metrics calculated using Water Withdrawn (OI0263) and Water Discharged (OI0386), can be used in conjunction with Water Type (OD7536) to describe water consumption in more detail. For further guidance on water uses, see the Alliance for Water Efficiency (http://www.allianceforwaterefficiency.org). In some contexts, this metric can serve as an indicator of whether the outcome being sought by an investor or organization is occurring (the WHAT dimension of impact). For more on the alignment of IRIS metrics to the five dimensions of impact, see IRIS+ and the Five Dimensions of Impact (https://iris.thegiin.org/document/iris-and-the-five-dimensions/). No single metric is sufficient to understand an impact; rather, metrics are selected as a set across all dimensions of impact. When possible, the selection of metrics to measure and describe the five dimensions should be based on best practice and evidence.
defined by: giin

Market Research on Clients
type: Concept
type: Code
has name: Market Research on Clients
has description: Indicates whether the organization uses market research to identify the needs of clients and potential clients.
definition: Indicates whether the organization uses market research to identify the needs of clients and potential clients.
has identifier: OI8113
notation: OI8113
had primary source: OI8113
note: Organizations should footnote the details of the market research that they conduct and the process and frequency with which they conduct the market research. See usage guidance for further information.
scope note: This metric is intended to capture whether the organization employs market research. Market research on clients enables organizations to better service their clients by understanding topics such as: the characteristics of their target clients, their clients' needs and preferences for products and for delivery channels, and potential barriers for their clients to access products, among other topics. Organizations can refer to the SPI4 (http://cerise-spi4.squarespace.com/), specifically Essential Practice 3a1, for additional indicators related to market research. SPI4 is a social audit tool, developed for financial service providers, which can apply to any organization with both social and financial objectives.
defined by: giin

Gross Written Premium
type: Concept
type: Code
has name: Gross Written Premium
has description: Amount of total insurance premium written or sold by the organization during the reporting period.
definition: Amount of total insurance premium written or sold by the organization during the reporting period.
has identifier: OI8115
notation: OI8115
had primary source: OI8115
note: Organizations should footnote all assumptions used.
scope note: This metric is intended to capture the amount of insurance premium written or sold by the organization during the reporting period. Organizations issuing insurance policies directly should report the amount of premium written, while organizations selling insurance policies underwritten by another organization may instead report the value of premiums sold. This metric is a proxy for resources of an insurer allocated to insurance policies.
defined by: giin

Board of Directors: Female
type: Concept
type: Code
has name: Board of Directors: Female
has description: Number of female members of the organization's board of directors or other governing body as of the end of the reporting period.
definition: Number of female members of the organization's board of directors or other governing body as of the end of the reporting period.
has identifier: OI8118
notation: OI8118
had primary source: OI8118
note: Organizations should footnote all assumptions used.
scope note: This metric is intended to capture female representation on the board of directors or governing body of an organization. A board of directors is a group of individuals legally responsible to govern a corporation and responsible to the shareholders and other relevant stakeholders. A governing body with a different name (e.g., "advisory body") may be considered a Board of Directors provided it has a fiduciary and/or social responsibility to shareholders and/or other relevant stakeholders. This metric is multi-dimensional with regard to the five dimensions of impact. It may help describe the WHO dimension when the stakeholder group represented by the metric is the stakeholder group targeted by the investment or organization. It may also help measure the HOW MUCH Scale dimension, which helps estimate the number of the targeted stakeholders experiencing the outcome. For more on the alignment of IRIS metrics to the five dimensions of impact, see IRIS+ and the Five Dimensions of Impact (https://iris.thegiin.org/document/iris-and-the-five-dimensions/). No single metric is sufficient to understand an impact; rather, metrics are selected as a set across all dimensions of impact. When possible, the selection of metrics to measure and describe the five dimensions should be based on best practice and evidence.
defined by: giin

Full-time Employees: Historically Marginalized
type: Concept
type: Code
has name: Full-time Employees: Historically Marginalized
has description: Number of paid, full-time employees at the organization who belong to groups historically marginalized on the basis of race and/or ethnicity as of the end of the reporting period.
definition: Number of paid, full-time employees at the organization who belong to groups historically marginalized on the basis of race and/or ethnicity as of the end of the reporting period.
has identifier: OI8147
notation: OI8147
had primary source: OI8147
note: Organizations should footnote all assumptions used, including their categorization of historically marginalized groups. See usage guidance for further information.
scope note: This metric is intended to capture the number of unique individuals who belong to groups historically marginalized on the basis of race and/or ethnicity and who are employed by the organization in full-time roles as of the end of the reporting period. This metric excludes Temporary Employees (OI9028). The categorization of historically marginalized groups varies with location and context. With no internationally agreed-upon definition as to which groups constitute historically marginalized on the basis of race and/or ethnicity, if well-established local policies exist (as in South Africa, with the Broad Based Black Economic Empowerment [BBBEE] definition of historically marginalized, or in India, based on backward caste), organizations should refer to these local guidelines to identify groups historically marginalized on the basis of race and/or ethnicity. Otherwise, and wherever appropriate, organizations should provide additional detail regarding their tailored methodology for defining these groups. This metric is multi-dimensional with regard to the five dimensions of impact: it may help describe the WHO dimension when the stakeholder group represented by the metric is the stakeholder group targeted by the investment or organization. It may also help measure the HOW MUCH Scale dimension, which helps estimate the number of the targeted stakeholders experiencing the outcome. For more on the alignment of IRIS metrics to the five dimensions of impact, see IRIS+ and the Five Dimensions of Impact (https://iris.thegiin.org/document/iris-and-the-five-dimensions/). No single metric is sufficient to understand an impact; rather, metrics are selected as a set across all dimensions of impact. When possible, the selection of metrics to measure and describe the five dimensions should be based on best practice and evidence.
defined by: giin

Founders: Female
type: Concept
type: Code
has name: Founders: Female
has description: Number of the organization’s founders who are female and retain an active role in the company as of the end of the reporting period.
definition: Number of the organization’s founders who are female and retain an active role in the company as of the end of the reporting period.
has identifier: OI8197
notation: OI8197
had primary source: OI8197
note: Organizations should footnote all assumptions used.
scope note: This metric is intended to capture the number of founders with an active role who are female. An active role may include acting in an advisory capacity for key decisions. It need not necessarily require a full-time role at the organization. This metric is multi-dimensional with regard to the five dimensions of impact. It may help describe the WHO dimension when the stakeholder group represented by the metric is the stakeholder group targeted by the investment or organization. It may also help measure the HOW MUCH Scale dimension, which helps estimate the number of the targeted stakeholders experiencing the outcome. For more on the alignment of IRIS metrics to the five dimensions of impact, see IRIS+ and the Five Dimensions of Impact (https://iris.thegiin.org/document/iris-and-the-five-dimensions/). No single metric is sufficient to understand an impact; rather, metrics are selected as a set across all dimensions of impact. When possible, the selection of metrics to measure and describe the five dimensions should be based on best practice and evidence.
defined by: giin

Greenhouse Gas Emissions Strategy
type: Concept
type: Code
has name: Greenhouse Gas Emissions Strategy
has description: Indicates whether the organization implements a strategy to reduce greenhouse gas (GHG) emissions.
definition: Indicates whether the organization implements a strategy to reduce greenhouse gas (GHG) emissions.
has identifier: OI8237
notation: OI8237
had primary source: OI8237
note: Organizations should footnote the details of the strategy, the type and scope of emissions on which the strategy focuses, and how the strategy is being implemented, including specific reduction targets. See usage guidance for further information.
scope note: This metric is intended to capture whether or not an organization has a greenhouse gas emissions strategy and to provide, in footnotes, detailed information on that strategy. It does not, however, evaluate the success with which that strategy is implemented. The Greenhouse Gas Protocol (GHG Protocol) is the most widely used international accounting tool to understand, quantify, and manage greenhouse gas emissions. The GHG Protocol defines direct and indirect emissions as follows: - Direct GHG emissions are emissions from sources that are owned or controlled by the reporting entity. - Indirect GHG emissions are emissions that result from the activities of the reporting entity but that occur at sources owned or controlled by other entities. The GHG Protocol further categorizes these direct and indirect emissions into three broad scopes. For more information on the GHG Protocol, organizations should refer to the following: - Greenhouse Gas Protocol Standards (http://www.ghgprotocol.org/standards) - Greenhouse Gas Protocol Calculators (https://ghgprotocol.org/calculation-tools) Organizations reporting this metric should also consider reporting against Greenhouse Gas Emissions: Total (OI1479), Greenhouse Gas Emissions: Direct (OI4112), and Greenhouse Gas Emissions: Indirect (OI9604).
defined by: giin

Full-time Employees: Managers
type: Concept
type: Code
has name: Full-time Employees: Managers
has description: Number of paid, full-time management employees (managers) at the organization as of the end of the reporting period.
definition: Number of paid, full-time management employees (managers) at the organization as of the end of the reporting period.
has identifier: OI8251
notation: OI8251
had primary source: OI8251
note: Organizations should footnote how their organization defines management levels. See usage guidance for further information.
scope note: This metric is intended to capture the number of unique, individual managers employed by the organization in full-time roles as of the end of the reporting period. This metric excludes Temporary Employees (OI9028). Organizations can refer to the glossary for additional guidance on defining management. The composition of management varies with an organization’s stage and type, but managers are generally responsible for setting objectives (defining goals for the group and deciding what work must be done to meet those goals), organizing (dividing work into manageable activities and selecting the right people to accomplish them), motivating and communicating (creating a team out of individuals through decisions on pay, promotion, and communications), measuring (establishing targets and interpreting and analyzing performance), and developing people. This metric is multi-dimensional with regard to the five dimensions of impact: it may help describe the WHO dimension when the stakeholder group represented by the metric is the stakeholder group targeted by the investment or organization. It may also help measure the HOW MUCH Scale dimension, which helps estimate the number of the targeted stakeholders experiencing the outcome. For more on the alignment of IRIS metrics to the five dimensions of impact, see IRIS+ and the Five Dimensions of Impact (https://iris.thegiin.org/document/iris-and-the-five-dimensions/). No single metric is sufficient to understand an impact; rather, metrics are selected as a set across all dimensions of impact. When possible, the selection of metrics to measure and describe the five dimensions should be based on best practice and evidence.
defined by: giin

Permanent Employees: Low-Income Areas
type: Concept
type: Code
has name: Permanent Employees: Low-Income Areas
has description: Number of people in paid employment with the organization who reside in low-income areas as of the end of the reporting period, whether they are full-time or part-time.
definition: Number of people in paid employment with the organization who reside in low-income areas as of the end of the reporting period, whether they are full-time or part-time.
has identifier: OI8266
notation: OI8266
had primary source: OI8266
note: Organizations should footnote details on the assessment tools used to identify employees who reside in low-income areas. See usage guidance for further information.
scope note: This metric is intended to capture the number of unique individuals employed by the organization in full- or part-time roles as of the end of the reporting period who reside in low-income areas. This metric excludes Temporary Employees (OI9028). The population classified as low income includes all those who fall below a fixed threshold, which includes those classified as poor or very poor. Because assessing the poverty level of employees is complex, organizations will likely use specific assessment tools to accurately report on this metric. See the glossary definition for additional information on commonly used tools to help determine the absolute poverty level of individuals and households. This metric is multi-dimensional with regard to the five dimensions of impact: it may help describe the WHO dimension when the stakeholder group represented by the metric is the stakeholder group targeted by the investment or organization. It may also help measure the HOW MUCH Scale dimension, which helps estimate the number of the targeted stakeholders experiencing the outcome. For more on the alignment of IRIS metrics to the five dimensions of impact, see IRIS+ and the Five Dimensions of Impact (https://iris.thegiin.org/document/iris-and-the-five-dimensions/). No single metric is sufficient to understand an impact; rather, metrics are selected as a set across all dimensions of impact. When possible, the selection of metrics to measure and describe the five dimensions should be based on best practice and evidence.
defined by: giin

Full-time Employees: Managers with Disabilities
type: Concept
type: Code
has name: Full-time Employees: Managers with Disabilities
has description: Number of paid, full-time management employees (managers) with disabilities at the organization as of the end of the reporting period.
definition: Number of paid, full-time management employees (managers) with disabilities at the organization as of the end of the reporting period.
has identifier: OI8292
notation: OI8292
had primary source: OI8292
note: Organizations should footnote how their organization defines management levels, as well as any specific focus on stakeholders with particular disabilities. See usage guidance for further information.
scope note: This metric is intended to capture the number of unique, individual managers with disabilities employed by the organization in full-time roles as of the end of the reporting period. This metric excludes Temporary Employees (OI9028). Organizations can refer to the glossary for additional guidance on defining management. The composition of management varies with an organization’s stage and type, but managers are generally responsible for setting objectives (defining goals for the group and deciding what work must be done to meet those goals), organizing (dividing work into manageable activities and selecting the right people to accomplish them), motivating and communicating (creating a team out of individuals through decisions on pay, promotion, and communications), measuring (establishing targets and interpreting and analyzing performance), and developing people. This metric is multi-dimensional with regard to the five dimensions of impact: it may help describe the WHO dimension when the stakeholder group represented by the metric is the stakeholder group targeted by the investment or organization. It may also help measure the HOW MUCH Scale dimension, which helps estimate the number of the targeted stakeholders experiencing the outcome. For more on the alignment of IRIS metrics to the five dimensions of impact, see IRIS+ and the Five Dimensions of Impact (https://iris.thegiin.org/document/iris-and-the-five-dimensions/). No single metric is sufficient to understand an impact; rather, metrics are selected as a set across all dimensions of impact. When possible, the selection of metrics to measure and describe the five dimensions should be based on best practice and evidence.
defined by: giin

Employees Earning Lowest Wage
type: Concept
type: Code
has name: Employees Earning Lowest Wage
has description: Number of full-time, part-time, and temporary employees of the organization that are earning the lowest hourly wage (including bonuses, excluding benefits) paid by the organization as of the end of the reporting period. See usage guidance for further details.
definition: Number of full-time, part-time, and temporary employees of the organization that are earning the lowest hourly wage (including bonuses, excluding benefits) paid by the organization as of the end of the reporting period. See usage guidance for further details.
has identifier: OI8296
notation: OI8296
had primary source: OI8296
note: Organizations should footnote the lowest wage paid by the organization in each country of operation, whether it meets or exceeds the local minimum wage for the region(s) in which they operate, and any other assumptions made in calculating this metric. See usage guidance for further information.
scope note: This metric is intended to measure the number of employees earning the lowest hourly wage paid by the organization during the reporting period. For example, if the organization's lowest wage paid (including bonuses, excluding benefits) is USD 15 per hour and the organizations pays 300 employees this rate, the value for this metric is 300. Organizations should also footnote what the lowest wage paid is in order to enable minimum wage calculations. To use this metric effectively, organizations working across multiple geographies should capture it at the country level. For each country, organizations should capture the lowest hourly wage paid and the number of employees earning that wage. In the event that an organization is unable to capture these data for each country, organizations are encouraged to capture this metric for the country with the largest number of employees. For salaried workers, organizations may calculate hourly wage by dividing total annual wages by number of hours worked. This metric can be useful in capturing whether a portion of the organization's workforce is paid less than minimum wage. Organizations interested in capturing minimum wage or living wage may instead use Employees Earning Minimum Wage (OI5858) and Employees Earning a Living Wage or Higher (OI4724). In some contexts, this metric can serve as an indicator of whether the outcome being sought by an investor or organization is occurring (the WHAT dimension of impact). For more on the alignment of IRIS metrics to the five dimensions of impact, see IRIS+ and the Five Dimensions of Impact (https://iris.thegiin.org/document/iris-and-the-five-dimensions/). No single metric is sufficient to understand an impact; rather, metrics are selected as a set across all dimensions of impact. When possible, the selection of metrics to measure and describe the five dimensions should be based on best practice and evidence.
defined by: giin

Waste Disposed: Incinerated
type: Concept
type: Code
has name: Waste Disposed: Incinerated
has description: Amount of waste disposed by the organization through incineration during the reporting period.
definition: Amount of waste disposed by the organization through incineration during the reporting period.
has identifier: OI8357
notation: OI8357
had primary source: OI8357
note: Organizations should footnote all assumptions used.
scope note: This metric is intended to capture the amount of waste the organization incinerated during the reporting period. In some contexts, this metric can serve as an indicator of whether the outcome being sought by an investor or organization is occurring (the WHAT dimension of impact). For more on the alignment of IRIS metrics to the five dimensions of impact, see IRIS+ and the Five Dimensions of Impact (https://iris.thegiin.org/document/iris-and-the-five-dimensions/). No single metric is sufficient to understand an impact; rather, metrics are selected as a set across all dimensions of impact. When possible, the selection of metrics to measure and describe the five dimensions should be based on best practice and evidence.
defined by: giin

Employees with Written Contracts
type: Concept
type: Code
has name: Employees with Written Contracts
has description: Number of employees (including both permanent and temporary workers) who had written contracts for their employment during the reporting period.
definition: Number of employees (including both permanent and temporary workers) who had written contracts for their employment during the reporting period.
has identifier: OI8358
notation: OI8358
had primary source: OI8358
note: Organizations should footnote all assumptions used.
scope note: This metric is intended to capture the number of employees during the reporting period who have formal, written contracts that state the terms of their employment. This metric is multidimensional with regard to the five dimensions of impact. In some contexts, this metric can serve as an indicator of whether the outcome being sought by an investor or organization is occurring (the WHAT dimension of impact). This metric may also help describe the HOW MUCH Scale dimension, which helps estimate the number of the targeted stakeholders experiencing the outcome. For more on the alignment of IRIS metrics to the five dimensions of impact, see IRIS+ and the Five Dimensions of Impact (https://iris.thegiin.org/document/iris-and-the-five-dimensions/). No single metric is sufficient to understand an impact; rather, metrics are selected as a set across all dimensions of impact. The selection of metrics to measure and describe the five dimensions should be based on best practice and evidence.
defined by: giin

Temporary Employees Hours Worked
type: Concept
type: Code
has name: Temporary Employees Hours Worked
has description: Number of paid hours worked by temporary employees of the organization during the reporting period.
definition: Number of paid hours worked by temporary employees of the organization during the reporting period.
has identifier: OI8408
notation: OI8408
had primary source: OI8408
note: Organizations should footnote all assumptions used.
scope note: This metric is intended to capture the number of hours worked by temporary employees over the course of the reporting period. Organizations should capture hours worked by contracted (or subcontracted) employees as part of this metric, whether their contracts are written or oral; in any case, temporary employment is characterized by a predefined term: fixed-term contracts, project- or task-based contracts, and seasonal, intermittent, or casual work. Organizations are encouraged to report this metric in conjunction with Temporary Employees (OI9028).
defined by: giin

Community Service Hours Contributed
type: Concept
type: Code
has name: Community Service Hours Contributed
has description: Number of hours volunteered by full- and part-time employees of the organization during the reporting period.
definition: Number of hours volunteered by full- and part-time employees of the organization during the reporting period.
has identifier: OI8429
notation: OI8429
had primary source: OI8429
note: Organizations should footnote all assumptions used. See usage guidance for further information.
scope note: This metric is intended to capture volunteer hours for community service contributed by employees. Organizations should include both paid and unpaid time spent volunteering, whether for company-organized events or for employee-initiated activities. Organizations are also encouraged to report separately volunteer hours contributed during traditional work hours and those contributed outside of traditional working hours. Traditional working hours can be defined by the organization and should be footnoted.
defined by: giin

Departed Permanent Employees: Voluntary
type: Concept
type: Code
has name: Departed Permanent Employees: Voluntary
has description: Number of full- and part-time employees who departed the organization voluntarily during the reporting period.
definition: Number of full- and part-time employees who departed the organization voluntarily during the reporting period.
has identifier: OI8431
notation: OI8431
had primary source: OI8431
note: Organizations should footnote all details regarding how they define voluntary departures. See usage guidance for further information.
scope note: This metric is intended to capture the number of voluntary departures from the organization, defined as those departed employees not dismissed for cause or otherwise involuntarily separated from the organization. Organizations can elect to exclude retiring employees when reporting against this metric and should footnote any relevant adjustments. This metric is multi-dimensional with regard to the five dimensions of impact: it may help describe the WHO dimension when the stakeholder group represented by the metric is the stakeholder group targeted by the investment or organization. It may also help measure the HOW MUCH Scale dimension, which helps estimate the number of the targeted stakeholders experiencing the outcome. For more on the alignment of IRIS metrics to the five dimensions of impact, see IRIS+ and the Five Dimensions of Impact (https://iris.thegiin.org/document/iris-and-the-five-dimensions/). No single metric is sufficient to understand an impact; rather, metrics are selected as a set across all dimensions of impact. When possible, the selection of metrics to measure and describe the five dimensions should be based on best practice and evidence.
defined by: giin

Peak Flow Rate
type: Concept
type: Code
has name: Peak Flow Rate
has description: Rate of maximum flow of water through a stream or river on land directly or indirectly managed by the organization as of the end of the reporting period.
definition: Rate of maximum flow of water through a stream or river on land directly or indirectly managed by the organization as of the end of the reporting period.
has identifier: OI8541
notation: OI8541
had primary source: OI8541
note: Organizations should footnote all assumptions used, including source(s) of data.
scope note: This metric is intended to capture the highest rate of water flowing through a stream or river per unit of time, typically measured in cubic feet per second or cubic meters per second. Maximum waterflow often occurs during storms. To calculate these data, organizations may use modeling tools such as HydroCAD's Rational Method (https://www.hydrocad.net/rational.htm) or USDA's WinTR-55 Watershed Hydrology (https://www.nrcs.usda.gov/wps/portal/nrcs/detailfull/national/water/?cid=stelprdb1042901).
defined by: giin

Employees Promoted: Female
type: Concept
type: Code
has name: Employees Promoted: Female
has description: Number of female employees who were promoted from within the organization during the reporting period.
definition: Number of female employees who were promoted from within the organization during the reporting period.
has identifier: OI8646
notation: OI8646
had primary source: OI8646
note: Organizations should footnote all assumptions used.
scope note: This metric is intended to capture the number of unique, female individuals promoted by the organization during the reporting period and who were in full- or part-time roles as of the end of the reporting period. This metric excludes Temporary Employees (OI9028). Organizations are encouraged to footnote in which roles and levels employees promoted began and ended the reporting period. Promotion (or career advancement) is defined as the movement of an employee who already works for the organization to a higher grade level either within the same department or to another department as a result of a change in duties, not a market adjustment in salary. For more, see the Society for Human Resource Management (https://www.shrm.org/resourcesandtools/tools-and-samples/policies/pages/job-posting-policy---staff-promotions.aspx). This metric is multi-dimensional with regard to the five dimensions of impact. It may help describe the WHO dimension when the stakeholder group represented by the metric is the stakeholder group targeted by the investment or organization. It may also help measure the HOW MUCH Scale dimension, which helps estimate the number of the targeted stakeholders experiencing the outcome. For more on the alignment of IRIS metrics to the five dimensions of impact, see IRIS+ and the Five Dimensions of Impact (https://iris.thegiin.org/document/iris-and-the-five-dimensions/). No single metric is sufficient to understand an impact; rather, metrics are selected as a set across all dimensions of impact. When possible, the selection of metrics to measure and describe the five dimensions should be based on best practice and evidence.
defined by: giin

Strikes and Lockouts
type: Concept
type: Code
has name: Strikes and Lockouts
has description: Number of employees' strikes and lockouts at the organization during the reporting period.
definition: Number of employees' strikes and lockouts at the organization during the reporting period.
has identifier: OI8670
notation: OI8670
had primary source: OI8670
note: Organizations should footnote details on the reasons for the strikes or lockouts, the number of employees involved, how long the strikes or lockouts lasted, and the resolution. See usage guidance for further information.
scope note: This metric is intended to capture the number of strikes and lockouts occurring among the organization's employees during the reporting period. Strikes and lockouts sometimes represent a breakdown in labor–management relations and a suspension of consultative processes. Data regarding the occurrence of such industrial incidents can usefully convey the state of labor–management relations and the direction of its progression over time. Strikes and lockouts must be set in the context of any limitations of local legislation and benchmarked against norms for inter-country, inter-industry, and inter-category comparisons. As employees take greater freedom in questioning their rights and respect in the workplace, organizations may observe strikes and lockouts increasing. As policies begin to take hold and change is effected, strikes and lockouts may then decrease. An employee strike is a work stoppage caused by one or several of the following voluntary actions by a number of employees: reducing the normal performance of their employment, breaking their employment agreements, refusing or failing to accept engagement for work in which they are usually employed, reducing their normal output, or reducing their normal rate of work. A strike usually happens in response to employee grievances. A lockout, also a work stoppage, is a temporary denial of employment initiated by the employer. Lockouts sometimes occur as a bargaining tactic by the employer in response to an employee strike.
defined by: giin

Investment Committee Members: Female
type: Concept
type: Code
has name: Investment Committee Members: Female
has description: Number of female members of the organization’s investment committee as of the end of the reporting period.
definition: Number of female members of the organization’s investment committee as of the end of the reporting period.
has identifier: OI8709
notation: OI8709
had primary source: OI8709
note: Organizations should footnote all assumptions used.
scope note: This metric is intended to capture the number of members of the organization’s investment committee who are women. An investment committee is the governing body that is charged with overseeing investments and developing investment policies for board approval. To report against 2X Challenge requirements, organizations at which female investment committee members do not play an active role on the investment committee should not be counted. The share of women on the investment committee should also exceed the legal minimum for the organization’s domicile country. This metric is multi-dimensional with regard to the five dimensions of impact. It may help describe the WHO dimension when the stakeholder group represented by the metric is the stakeholder group targeted by the investment or organization. It may also help measure the HOW MUCH Scale dimension, which helps estimate the number of the targeted stakeholders experiencing the outcome. For more on the alignment of IRIS metrics to the five dimensions of impact, see IRIS+ and the Five Dimensions of Impact (https://iris.thegiin.org/document/iris-and-the-five-dimensions/). No single metric is sufficient to understand an impact; rather, metrics are selected as a set across all dimensions of impact. When possible, the selection of metrics to measure and describe the five dimensions should be based on best practice and evidence.
defined by: giin

Part-time Wages: Female
type: Concept
type: Code
has name: Part-time Wages: Female
has description: Value of wages (including bonuses, excluding benefits) paid to all female part-time employees of the organization during the reporting period.
definition: Value of wages (including bonuses, excluding benefits) paid to all female part-time employees of the organization during the reporting period.
has identifier: OI8725
notation: OI8725
had primary source: OI8725
scope note: This metric is intended to capture pre-tax wages/salaries paid to the organization's part-time female employees and should not include benefits nor include payroll expenses. These wages should exclude Temporary Employee Wages (OI4202).
defined by: giin

Average Non-Salaried Wage
type: Concept
type: Code
has name: Average Non-Salaried Wage
has description: Average wage paid to non-salaried and full-time, part-time, or temporary employees of the organization during the reporting period. Employees who are salaried should be excluded from this calculation.
definition: Average wage paid to non-salaried and full-time, part-time, or temporary employees of the organization during the reporting period. Employees who are salaried should be excluded from this calculation.
has identifier: OI8791
notation: OI8791
had primary source: OI8791
note: Organizations should footnote the time frame over which this metric is calculated and all assumptions used. See usage guidance for further information.
scope note: This metric is intended to capture the average (mean) non-salaried wage paid to employees of the organization during the reporting period. Organizations can narrow this metric to, for instance, specific geographies, industries, departments, or positions, and organizations should footnote details on how the calculation was done. Organizations are also encouraged to break down and footnote for each the average respective non-salaried wages for full-time, part-time, and temporary employees. Non-salaried employees are paid on a variable basis (such as hourly, daily, weekly, other specified time cycle, or other specified parameter). Since the time frame for non-salaried employees can vary, organizations should footnote the time frame used in this calculation. Non-salaried employees' earnings are contingent on the amount of time worked.
defined by: giin

Energy Purchased: Total
type: Concept
type: Code
has name: Energy Purchased: Total
has description: Amount of purchased energy consumed by the organization during the reporting period.
definition: Amount of purchased energy consumed by the organization during the reporting period.
has identifier: OI8825
notation: OI8825
had primary source: OI8825
note: Organizations should footnote all assumptions used.
scope note: This metric is intended to capture the amount of energy (both renewable and non-renewable) purchased for use by the organization itself. Adding Energy Generated for Use: Total (OI9624) to this metric should equal the total energy consumed by the organization during the reporting period. To disaggregate this total by the type of energy purchased—for example, non-renewable vs. renewable sources—report this metric disaggregated by the relevant options from Primary Energy Source (OI3781). In some contexts, this metric can serve as an indicator of whether the outcome being sought by an investor or organization is occurring (the WHAT dimension of impact). For more on the alignment of IRIS metrics to the five dimensions of impact, see IRIS+ and the Five Dimensions of Impact (https://iris.thegiin.org/document/iris-and-the-five-dimensions/). No single metric is sufficient to understand an impact; rather, metrics are selected as a set across all dimensions of impact. When possible, the selection of metrics to measure and describe the five dimensions should be based on best practice and evidence.
defined by: giin

Water Consumed: Wastewater
type: Concept
type: Code
has name: Water Consumed: Wastewater
has description: Volume of wastewater used for the organization's operations during the reporting period.
definition: Volume of wastewater used for the organization's operations during the reporting period.
has identifier: OI8828
notation: OI8828
had primary source: OI8828
note: Organizations should footnote all assumptions used.
scope note: This metric is intended to capture the volume of wastewater used within the organization for any purpose, including but not limited to productive processes (for example, packaging and manufacturing), human consumption, and agricultural purposes. This metric, as well as other metrics calculated using Water Withdrawn (OI0263) and Water Discharged (OI0386), can be used in conjunction with Water Type (OD7536) to describe water consumption in more detail. For further guidance on water uses, see the Alliance for Water Efficiency (http://www.allianceforwaterefficiency.org). In some contexts, this metric can serve as an indicator of whether the outcome being sought by an investor or organization is occurring (the WHAT dimension of impact). For more on the alignment of IRIS metrics to the five dimensions of impact, see IRIS+ and the Five Dimensions of Impact (https://iris.thegiin.org/document/iris-and-the-five-dimensions/). No single metric is sufficient to understand an impact; rather, metrics are selected as a set across all dimensions of impact. When possible, the selection of metrics to measure and describe the five dimensions should be based on best practice and evidence.
defined by: giin

Part-time Employees: Female
type: Concept
type: Code
has name: Part-time Employees: Female
has description: Number of paid, part-time, female employees at the organization as of the end of the reporting period.
definition: Number of paid, part-time, female employees at the organization as of the end of the reporting period.
has identifier: OI8838
notation: OI8838
had primary source: OI8838
note: Organizations should footnote all assumptions used.
scope note: This metric is intended to capture the number of unique women employed by the organization in part-time roles as of the end of the reporting period. This metric excludes Temporary Employees (OI9028). This metric is multi-dimensional with regard to the five dimensions of impact: it may help describe the WHO dimension when the stakeholder group represented by the metric is the stakeholder group targeted by the investment or organization. It may also help measure the HOW MUCH Scale dimension, which helps estimate the number of the targeted stakeholders experiencing the outcome. For more on the alignment of IRIS metrics to the five dimensions of impact, see IRIS+ and the Five Dimensions of Impact (https://iris.thegiin.org/document/iris-and-the-five-dimensions/). No single metric is sufficient to understand an impact; rather, metrics are selected as a set across all dimensions of impact. When possible, the selection of metrics to measure and describe the five dimensions should be based on best practice and evidence.
defined by: giin

Waste Disposed: Other
type: Concept
type: Code
has name: Waste Disposed: Other
has description: Amount of waste disposed by the organization through other means during the reporting period.
definition: Amount of waste disposed by the organization through other means during the reporting period.
has identifier: OI8843
notation: OI8843
had primary source: OI8843
note: Organizations should footnote all assumptions used, as well as the specific means of disposal.
scope note: This metric is intended to capture the amount of waste the organization disposed by other means during the reporting period (not sent to landfill, recycled/reused, incinerated, or composted). Organizations should footnote the means of disposal. In some contexts, this metric can serve as an indicator of whether the outcome being sought by an investor or organization is occurring (the WHAT dimension of impact). For more on the alignment of IRIS metrics to the five dimensions of impact, see IRIS+ and the Five Dimensions of Impact (https://iris.thegiin.org/document/iris-and-the-five-dimensions/). No single metric is sufficient to understand an impact; rather, metrics are selected as a set across all dimensions of impact. When possible, the selection of metrics to measure and describe the five dimensions should be based on best practice and evidence.
defined by: giin

Part-time Employees: Total
type: Concept
type: Code
has name: Part-time Employees: Total
has description: Number of paid, part-time employees at the organization as of the end of the reporting period.
definition: Number of paid, part-time employees at the organization as of the end of the reporting period.
has identifier: OI8864
notation: OI8864
had primary source: OI8864
note: Organizations should footnote all assumptions used.
scope note: This metric is intended to capture the number of unique individuals employed by the organization in part-time roles as of the end of the reporting period. This metric excludes Temporary Employees (OI9028). This metric is multi-dimensional with regard to the five dimensions of impact: it may help describe the WHO dimension when the stakeholder group represented by the metric is the stakeholder group targeted by the investment or organization. It may also help measure the HOW MUCH Scale dimension, which helps estimate the number of the targeted stakeholders experiencing the outcome. For more on the alignment of IRIS metrics to the five dimensions of impact, see IRIS+ and the Five Dimensions of Impact (https://iris.thegiin.org/document/iris-and-the-five-dimensions/). No single metric is sufficient to understand an impact; rather, metrics are selected as a set across all dimensions of impact. When possible, the selection of metrics to measure and describe the five dimensions should be based on best practice and evidence.
defined by: giin

Employment Benefits Uptake
type: Concept
type: Code
has name: Employment Benefits Uptake
has description: Percentage of all employees using employee benefits provided by the organization as of the end of the reporting period.
definition: Percentage of all employees using employee benefits provided by the organization as of the end of the reporting period.
has identifier: OI8865
notation: OI8865
had primary source: OI8865
note: Organizations should footnote all assumptions used.
scope note: This metric is intended to capture the degree to which employees are actively using benefits provided to them by their employer. This helps to understand whether benefits are actually accessible and helpful to employees, or if they are benefits in name only. To use this metric, organizations should first report Employment Benefits (OI2742) to specify which benefits the organization provides to its employees. Then, organizations should use this metric to capture the percentage of employees who use each of those benefits. This metric aligns in part with Disclosure 401-3b from GRI 401: Employment 2016. This metric may help describe the HOW MUCH Scale dimension, which helps estimate the number of the targeted stakeholders experiencing the outcome. For more on the alignment of IRIS metrics to the five dimensions of impact, see IRIS+ and the Five Dimensions of Impact (https://iris.thegiin.org/document/iris-and-the-five-dimensions/). No single metric is sufficient to understand an impact; rather, metrics are selected as a set across all dimensions of impact. The selection of metrics to measure and describe the five dimensions should be based on best practice and evidence.
defined by: giin

Permanent Employees: Total
type: Concept
type: Code
has name: Permanent Employees: Total
has description: Number of people in paid employment with the organization as of the end of the reporting period, whether they are full-time or part-time.
definition: Number of people in paid employment with the organization as of the end of the reporting period, whether they are full-time or part-time.
has identifier: OI8869
notation: OI8869
had primary source: OI8869
note: Organizations should footnote all assumptions used.
scope note: This metric is intended to capture the number of unique individuals employed by the organization in full- or part-time roles as of the end of the reporting period. This metric excludes Temporary Employees (OI9028). This metric is multi-dimensional with regard to the five dimensions of impact: it may help describe the WHO dimension when the stakeholder group represented by the metric is the stakeholder group targeted by the investment or organization. It may also help measure the HOW MUCH Scale dimension, which helps estimate the number of the targeted stakeholders experiencing the outcome. For more on the alignment of IRIS metrics to the five dimensions of impact, see IRIS+ and the Five Dimensions of Impact (https://iris.thegiin.org/document/iris-and-the-five-dimensions/). No single metric is sufficient to understand an impact; rather, metrics are selected as a set across all dimensions of impact. When possible, the selection of metrics to measure and describe the five dimensions should be based on best practice and evidence.
defined by: giin

Full-time Wages: Female
type: Concept
type: Code
has name: Full-time Wages: Female
has description: Value of wages (including bonuses and excluding benefits) paid to all female full-time employees of the organization during the reporting period.
definition: Value of wages (including bonuses and excluding benefits) paid to all female full-time employees of the organization during the reporting period.
has identifier: OI8941
notation: OI8941
had primary source: OI8941
note: Organizations should footnote all assumptions used.
scope note: This metric is intended to capture pre-tax wages and salaries paid to the organization's full-time female employees and should include neither benefits nor payroll expenses. This metric should exclude Temporary Employee Wages (OI4202).
defined by: giin

Temporary Employees
type: Concept
type: Code
has name: Temporary Employees
has description: Number of temporary employees paid by the organization during the reporting period.
definition: Number of temporary employees paid by the organization during the reporting period.
has identifier: OI9028
notation: OI9028
had primary source: OI9028
note: Organizations should footnote details regarding the type of temporary employment provided, as well as all assumptions used. See usage guidance for further information.
scope note: This metric is intended to capture the number of temporary employees who worked for the organization at any point during the reporting period. For example, if an employee worked at some point during the reporting period but was not employed as of the end of the reporting period, such an individual should be counted under this metric. Temporary employees include contracted (or subcontracted) employees, whether their contracts are written or oral; in any case, temporary employment is characterized by a predefined term: fixed-term contracts, project- or task-based contracts, and seasonal, intermittent, or casual work. Relevant details to footnote regarding the type of temporary employment provided could include, among other things, the typical duration of temporary employees’ contracts and the breakdown between full- and part-time temporary employees. Organizations are encouraged to report this metric in conjunction with Temporary Employee Hours Worked (OI8408). To align to the HIPSO (Harmonized Indicators for Private Sector Operations) indicator Construction Jobs (Temporary Construction), organizations may use this metric and calculate using it and Temporary Employee Hours Worked (OI8408) the number of full-time equivalent (FTE) jobs. For more on this calculation, see Jobs in Directly Supported/Financed Enterprises (PI4874). In order to align with this HIPSO indicator, organizations should include all workers involved in the construction of any company assets, including those employed by third parties if they are working on-site; however, organizations should exclude construction workers if the organization itself is a construction or real estate company. This metric is multi-dimensional with regard to the five dimensions of impact. It may help describe the WHO dimension when the stakeholder group represented by the metric is the stakeholder group targeted by the investment or organization. It may also help measure the HOW MUCH Scale dimension, which helps estimate th…
defined by: giin

Number of Employee Grievances Resolved
type: Concept
type: Code
has name: Number of Employee Grievances Resolved
has description: Number of formal grievances registered by employees of the organization that were resolved during the reporting period.
definition: Number of formal grievances registered by employees of the organization that were resolved during the reporting period.
has identifier: OI9077
notation: OI9077
had primary source: OI9077
note: Organizations should footnote all assumptions used.
scope note: This metric is intended to capture the number of grievances that were formally resolved through the organization's employee grievance mechanism during the reporting period. This metric does not capture the total number of grievances registered during the reporting period, which should be reported under Number of Employee Grievances Registered (OI1042). To capture whether the organization has an employee grievance and feedback system in general, organizations should use Employee Feedback and Grievance System (OI3601). Organizations are also encouraged to footnote the ownership of the mechanism, the purpose of the mechanism and its relationship to other grievance mechanisms, the organization’s activities that are covered by the mechanism, the intended users of the mechanism, how the mechanism is managed, the process to address and resolve grievances (including how decisions are made), and the effectiveness criteria used (see GRI 103-2). Effective grievance mechanisms should be legitimate, accessible, predictable, equitable, transparent, rights-compatible, and a source of continuous learning (GRI 2018). For operational-level mechanisms to be effective, they should be based on engagement and dialogue. For a description of each of these criteria, see Guiding Principle 31. United Nations (UN), ‘Guiding Principles on Business and Human Rights, Implementing the United Nations “Protect, Respect and Remedy” Framework,’ 2011. This metric may help describe the HOW MUCH Scale dimension, which helps estimate the number of the targeted stakeholders experiencing the outcome. For more on the alignment of IRIS metrics to the five dimensions of impact, see IRIS+ and the Five Dimensions of Impact (https://iris.thegiin.org/document/iris-and-the-five-dimensions/). No single metric is sufficient to understand an impact; rather, metrics are selected as a set across all dimensions of impact. The selection of metrics to measure and describe the five dimensions should be based on best practic…
defined by: giin

Sexual Harassment Policy
type: Concept
type: Code
has name: Sexual Harassment Policy
has description: Indicates whether the organization has a written policy to combat and prevent the sexual harassment of employees and a system to monitor compliance with this policy.
definition: Indicates whether the organization has a written policy to combat and prevent the sexual harassment of employees and a system to monitor compliance with this policy.
has identifier: OI9088
notation: OI9088
had primary source: OI9088
note: Organizations should footnote the details about its sexual harassment policy and how it is being implemented.
scope note: This metric is intended to capture the organization’s policy on sexual harassment. The policy should align with internationally recognized standards.
defined by: giin

Social and Environmental Performance Risk Assessment
type: Concept
type: Code
has name: Social and Environmental Performance Risk Assessment
has description: Indicates whether the organization assessed social and environmental risks during the reporting period.
definition: Indicates whether the organization assessed social and environmental risks during the reporting period.
has identifier: OI9106
notation: OI9106
had primary source: OI9106
note: Organizations should footnote details on what risks they assessed and how these were addressed. See usage guidance for further information.
scope note: This metric is intended to capture whether the organization systematically assesses risks to social and environmental performance. Examples of social risks to footnote, if relevant, include: mission drift, reputational risk, incidents resulting in harm to clients, client exit, employee dissatisfaction, incentives that can lead to negative behaviors among employees, lack of transparency, negative environmental impacts, gender inequalities and/or discrimination, and lack of implementation of policies, among others. Examples of environmental risks to footnote, if relevant, include: license to operate, reputational risk, incidents resulting in harm to client or the environment (e.g., hazardous waste spills), negative social risks, risks to supply chain sustainability and security, regulatory risk, and climate risk, among others. Organizations are also encouraged to footnote the frequency with which they assess social and environmental performance risks and whether their risk management procedures reflect social and environmental risk criteria. Organizations can refer to the Smart Campaign's Client Protection Principles (www.smartcampaign.org) and the indicators in the Green Module of the SPI4 (http://cerise-spi4.squarespace.com/) for further guidance. Organizations are encouraged to report this metric in conjunction with Social and Environmental Performance Reporting (OI4732) and Social and Environmental Targets (OD4091).
defined by: giin

Streamflow Rate
type: Concept
type: Code
has name: Streamflow Rate
has description: Rate of flowing water in a stream or river on land directly or indirectly managed by the organization as of the end of the reporting period.
definition: Rate of flowing water in a stream or river on land directly or indirectly managed by the organization as of the end of the reporting period.
has identifier: OI9202
notation: OI9202
had primary source: OI9202
note: Organizations should footnote all assumptions used, including source(s) of data.
scope note: This metric is intended to capture the volume of water flowing through a stream or river per unit time, typically measured in cubic feet per second or cubic meters per second. These data are often calculated based on models such as MIKE-SHE/BASIN (https://www.mikepoweredbydhi.com/products/mike-she), RIBASIM (https://www.deltares.nl/en/software/ribasim/), and WEAP (https://www.weap21.org/). To calibrate models, investors may consult resources such as Water Canary (https://www.watercanary.com/). Further data can be found from sources such as HydroAtlas (https://www.hydrosheds.org/page/hydroatlas) and Conservation Gateway's Global Streamflow Databases (https://www.conservationgateway.org/ConservationPractices/Freshwater/EnvironmentalFlows/MethodsandTools/ELOHA/Pages/Global-Streamflow-Databases.aspx). Organizations may report this metric in conjunction with Land Indirectly Controlled: Total (PI3789) and Land Directly Controlled: Total (OI5408). In some contexts, this metric can serve as an indicator of whether the outcome being sought by an investor or organization is occurring (the WHAT dimension of impact). For more on the alignment of IRIS metrics to the five dimensions of impact, see IRIS+ and the Five Dimensions of Impact (https://iris.thegiin.org/document/iris-and-the-five-dimensions/). No single metric is sufficient to understand an impact; rather, metrics are selected as a set across all dimensions of impact. When possible, the selection of metrics to measure and describe the five dimensions should be based on best practice and evidence.
defined by: giin

Renewable Energy Expenditures
type: Concept
type: Code
has name: Renewable Energy Expenditures
has description: Amount of money spent by the organization for renewable energy infrastructure and technology to produce energy intended for consumption at the organization's operating facilities during the reporting period.
definition: Amount of money spent by the organization for renewable energy infrastructure and technology to produce energy intended for consumption at the organization's operating facilities during the reporting period.
has identifier: OI9206
notation: OI9206
had primary source: OI9206
note: Organizations should footnote the type of expenditures made and details on the energy sources to be used. See usage guidance for further information.
scope note: This metric is intended to capture the organization’s investments in infrastructure to produce energy that will be consumed by the organization. For example, a large-scale manufacturing facility in the desert might install a solar array or wind farm. Renewable energy sources include solar, wind, geothermal, hydro energy, and biomass, among other forms. Organizations can refer to the glossary for additional information. Large-scale hydropower is often excluded from the definition of renewable energy. Although water itself is a renewable resource, the natural ecology of rivers is not, and hydroelectric dams can adversely affect aquatic ecosystems. Organizations can refer to the Low Impact Hydropower Institute (http://lowimpacthydro.org) for further guidance on creating low-impact hydropower operations. Organizations may have various motivations for making these capital expenditures, including reducing Greenhouse Gas (GHG) emissions, reducing long-term energy expenditures, increasing the stability of energy pricing, or diversifying their sources of energy supply. Organizations are encouraged to footnote changes in the organization's regular, recurring energy costs caused by their investments in renewable energy infrastructure and technology. Organizations are encouraged to report this metric in conjunction with Green Building Practices (OI6765).
defined by: giin

Water Treatment Level
type: Concept
type: Code
has name: Water Treatment Level
has identifier: OI9278
notation: OI9278
had primary source: OI9278
note: Organizations should footnote all assumptions used, including source(s) of data.
scope note: This metric is intended to capture the level of water treatment enacted by the organization during the reporting period. Organizations may report the level of treatment for any water or effluents at the point of discharge, whether treated themselves onsite or sent to a third party for treatment. Both lagoon and mechanical treatment can be included, where appropriate. This metric applies to all elements of water discharge, including used water, unused water, and effluents. Organizations may use this metric to disaggregate Water Discharged (OD0386) by volume of water treated. For sanitation-related investments, organizations should disaggregate and apply this calculation specifically to wastewater. Treating water aims to improve water’s quality to make it more acceptable for an end-use, such as drinking, industry, or safe return to the environment, by removing or reducing existing water contaminants. Increasing population pressure is increasing the amount of wastewater. Untreated effluent is discharged to water bodies and terrestrial ecosystems, leading to nutrient surpluses (which can cause anoxic conditions and species loss) and the presence of toxic, often non-degradable compounds in ecosystems. Untreated wastewater contains pathogens that can contaminate drinking water. Treating and recycling polluted water can help tackle water shortages. Minimum requirements for treatment might be specified by national, sub-national, or local legislation; in setting treatment levels, however, organizations should consider the impacts of their overall water discharge and the needs of other water users. For further guidance on treatment requirements, see SDG 6: Progress on Wastewater Treatment (https://apps.who.int/iris/bitstream/handle/10665/275967/9789241514897-eng.pdf?ua=1).
has description: Describes the level of treatment that discharged water received during the reporting period. Choose all that apply: - Primary treatment - Secondary treatment - Tertiary treatment - No treatment
definition: Describes the level of treatment that discharged water received during the reporting period. Choose all that apply: - Primary treatment - Secondary treatment - Tertiary treatment - No treatment
defined by: giin

Water Conservation Strategy
type: Concept
type: Code
has name: Water Conservation Strategy
has description: Indicates whether the organization implements a conservation strategy to reduce its water usage.
definition: Indicates whether the organization implements a conservation strategy to reduce its water usage.
has identifier: OI9326
notation: OI9326
had primary source: OI9326
note: Organizations should footnote the details of their strategy, including how it is being implemented, how water usage is recorded, and specific reduction targets. Organizations should also footnote any elements in the strategy that address risks associated with water withdrawal. See usage guidance for further information.
scope note: This metric is intended to capture detailed information on the organization’s water conservation strategy in place but does not evaluate the success with which that strategy is implemented. Water conservation encompasses efforts made to reduce the amount of water needed to execute current processes or tasks. This metric is not intended to capture overall reduced water consumption due to reduced organizational activities (e.g., partial outsourcing of production). Details of water conservation efforts to footnote include organizational or technological innovations that allow a defined process or task to consume water more efficiently. These may include improved water-management practices, process redesign, the conversion and retrofitting of equipment (e.g., water-efficient equipment), or the elimination of unnecessary water use through changes in behavior. Organizations’ water-reduction strategies could also include seeking alternative water sources such as gray water or rainwater capture systems. Organizations should footnote which efforts are components of their strategy. Mismanagement of water can pose risks to operational elements including brand, credibility, credit rating, insurance, and operating costs. Organizations should footnote their analysis of such risks and how they are being addressed. Organizations are encouraged to report the amount of water conserved using Water Conserved (OI4015) and Water Used: Total (OI1697), plus its related submetrics.
defined by: giin

Anti-Discrimination Policy
type: Concept
type: Code
has name: Anti-Discrimination Policy
has identifier: OI9331
notation: OI9331
had primary source: OI9331
note: Organizations should footnote details about the policy, including the types of discrimination protected against and the systems in place to ensure compliance. See usage guidance for further information.
scope note: This metric is intended to capture the organization’s policy to combat discrimination in the workplace. Anti-discrimination policies, often called non-discrimination or equal employment opportunity policies, prohibit or penalize discrimination on the basis of age; color; disability; gender expression; gender identity; HIV status; marital status; national, social, or ethnic origin; participation in collective bargaining agreements; political opinion; race; religion; or sexual orientation. Such policies prohibit making recruitment, compensation, termination, promotion, or any other conditions of employment contingent upon any of the affiliations listed above for any employee or job applicant. Organizations can refer to the following sources for additional information on best practices: - Human Rights Campaign: Workplace Discrimination (http://www.hrc.org/resources/entry/Workplace-Discrimination-Policies-Laws-and-Legislation) - Human Rights Campaign: Equal Employment Opportunity (http://www.hrc.org/resources/entry/sample-equal-employment-opportunity-policies)
has description: This metric is intended to capture detailed information on the organization’s water conservation strategy in place but does not evaluate the success with which that strategy is implemented. Water conservation encompasses efforts made to reduce the amount of water needed to execute current processes or tasks. This metric is not intended to capture overall reduced water consumption due to reduced organizational activities (e.g., partial outsourcing of production). Details of water conservation efforts to footnote include organizational or technological innovations that allow a defined process or task to consume water more efficiently. These may include improved water-management practices, process redesign, the conversion and retrofitting of equipment (e.g., water-efficient equipment), or the elimination of unnecessary water use through changes in behavior. Organizations’ water-reduction strategies could also include seeking alternative water sources such as gray water or rainwater capture systems. Organizations should footnote which efforts are components of their strategy. Mismanagement of water can pose risks to operational elements including brand, credibility, credit rating, insurance, and operating costs. Organizations should footnote their analysis of such risks and how they are being addressed. Organizations are encouraged to report the amount of water conserved using Water Conserved (OI4015) and Water Used: Total (OI1697), plus its related submetrics.
definition: This metric is intended to capture detailed information on the organization’s water conservation strategy in place but does not evaluate the success with which that strategy is implemented. Water conservation encompasses efforts made to reduce the amount of water needed to execute current processes or tasks. This metric is not intended to capture overall reduced water consumption due to reduced organizational activities (e.g., partial outsourcing of production). Details of water conservation efforts to footnote include organizational or technological innovations that allow a defined process or task to consume water more efficiently. These may include improved water-management practices, process redesign, the conversion and retrofitting of equipment (e.g., water-efficient equipment), or the elimination of unnecessary water use through changes in behavior. Organizations’ water-reduction strategies could also include seeking alternative water sources such as gray water or rainwater capture systems. Organizations should footnote which efforts are components of their strategy. Mismanagement of water can pose risks to operational elements including brand, credibility, credit rating, insurance, and operating costs. Organizations should footnote their analysis of such risks and how they are being addressed. Organizations are encouraged to report the amount of water conserved using Water Conserved (OI4015) and Water Used: Total (OI1697), plus its related submetrics.
defined by: giin

Local Compliance
type: Concept
type: Code
has name: Local Compliance
has description: Indicates whether the organization has been identified as out of compliance with any local labor, tax, or environmental regulations during the reporting period.
definition: Indicates whether the organization has been identified as out of compliance with any local labor, tax, or environmental regulations during the reporting period.
has identifier: OI9379
notation: OI9379
had primary source: OI9379
scope note: This metric is intended to capture the organization’s lack of compliance with local regulations, if any. Organizations should consider reporting this metric in conjunction with Number of Legal and Regulatory Complaints (OI2165) and Value of Fines and Settlements (OI7639).
defined by: giin

Wastewater Treated
type: Concept
type: Code
has name: Wastewater Treated
has description: Volume of wastewater treated by the organization during the reporting period.
definition: Volume of wastewater treated by the organization during the reporting period.
has identifier: OI9412
notation: OI9412
had primary source: OI9412
note: Organizations should footnote details about their wastewater treatment practices and all assumptions used. See usage guidance for further information.
scope note: This metric is intended to capture how much wastewater derived from an organization's productive or operational processes is treated. Wastewater, or water that carries wastes, is usually a mixture of water and dissolved or suspended solids. Treatment aims to improve the quality of the wastewater before the remaining water is discharged back to the environment by reducing suspended solids, biodegradable organics, pathogenic bacteria, and nutrients. Wastewater treatment typically takes place over three levels: primary (mechanical), secondary (biological), and tertiary. Organizations may further specify the wastewater's level of treatment by disaggregating this metric by Water Treatment Level (OI9278). In some contexts, this metric can serve as an indicator of whether the outcome being sought by an investor or organization is occurring (the WHAT dimension of impact). For more on the alignment of IRIS metrics to the five dimensions of impact, see IRIS+ and the Five Dimensions of Impact (https://iris.thegiin.org/document/iris-and-the-five-dimensions/). No single metric is sufficient to understand an impact; rather, metrics are selected as a set across all dimensions of impact. When possible, the selection of metrics to measure and describe the five dimensions should be based on best practice and evidence.
defined by: giin

Community Health Resilience and Improvement Strategy
type: Concept
type: Code
has name: Community Health Resilience and Improvement Strategy
has description: Indicates whether the organization implemented a community health resilience and improvement strategy during the reporting period to improve health outcomes and increase the resilience of target stakeholder populations.
definition: Indicates whether the organization implemented a community health resilience and improvement strategy during the reporting period to improve health outcomes and increase the resilience of target stakeholder populations.
has identifier: OI9417
notation: OI9417
had primary source: OI9417
note: Organizations should footnote all assumptions used.
scope note: This metric is intended to capture whether an organization has a health resilience and improvement strategy in place but does not evaluate the effectiveness of that strategy. Organizations are encouraged to footnote qualitative or narrative data regarding how their business activities may impact health outcomes, as well as steps taken to improve health outcomes and increase the resilience of target stakeholder populations.
defined by: giin

Fair Dismissal Policy
type: Concept
type: Code
has name: Fair Dismissal Policy
has description: Indicates whether the organization has a written policy and practice of ensuring fair dismissal of employees and a system to monitor compliance with this policy.
definition: Indicates whether the organization has a written policy and practice of ensuring fair dismissal of employees and a system to monitor compliance with this policy.
has identifier: OI9478
notation: OI9478
had primary source: OI9478
note: Organizations should footnote details about its fair dismissal policy. See usage guidance for further information.
scope note: This metric is intended to capture the organization’s policy on fair dismissal. The ILO defines the boundaries for what is considered fair dismissal. Reasons for dismissal which are considered unfair dismissal include those based on union membership or participation in union activities, those in response to filing a complaint against an employer, or those based on race, color, sex, marital status, family responsibilities, pregnancy, religion, political opinion, national extraction or social origin, temporary absence due to illness, or absence from work during maternity leave. Organizations can refer to the following source for further guidance: International Labour Organization, Termination of Employment at the Initiative of the Employer (http://www.ilo.org/public/libdoc/ilo/1982/82B09_147_engl.pdf) Organizations are encouraged to report this metric in conjunction with Employee Involuntary Turnover Rate (OI3989) and Employee Voluntary Turnover Rate (OI1638).
defined by: giin

Diverse Representation Policy
type: Concept
type: Code
has name: Diverse Representation Policy
has description: Indicates whether the company has a written policy on diverse representation and a system to monitor compliance with this policy.
definition: Indicates whether the company has a written policy on diverse representation and a system to monitor compliance with this policy.
has identifier: OI9485
notation: OI9485
had primary source: OI9485
note: Organizations should footnote at what levels of the organization this policy applies (including board of directors, C-suite, and management levels), as well as what mechanisms are in place to enforce this policy.
scope note: This metric is intended to capture the organization’s policy on diverse representation. Organizations using this metric should consider whether their policy accounts for the representation of women; members of groups historically marginalized on the basis of race and/or ethnicity, including people of color; gender and sexual minorities; and people living with disabilities.
defined by: giin

Greenhouse Gas Emissions: Indirect (Scope 2)
type: Concept
type: Code
has name: Greenhouse Gas Emissions: Indirect (Scope 2)
has description: Amount of greenhouse gases (GHG) emitted from indirect emissions sources as a result of the organization's operations during the reporting period.
definition: Amount of greenhouse gases (GHG) emitted from indirect emissions sources as a result of the organization's operations during the reporting period.
has identifier: OI9604
notation: OI9604
had primary source: OI9604
note: Organizations should footnote all assumptions used, including detailed information on their calculation methodology and source of data. See usage guidance for further information.
scope note: This metric is intended to capture the amount of greenhouse gases emitted indirectly by the organization from the generation of purchased energy during the reporting period. For tools that may be helpful in calculating this and related metrics, see GHG Protocol Calculators (https://ghgprotocol.org/calculation-tools). The Greenhouse Gas Protocol (GHG Protocol), the most widely used international accounting tool to understand, quantify, and manage greenhouse gas emissions, defines indirect emissions as emissions that result from the activities of the reporting entity but that occur at sources owned or controlled by other entities. The GHG Protocol further categorizes indirect emissions into "Scope 2" and "Scope 3." Scope 2 includes GHG emissions resulting from the consumption of purchased electricity, heat, or steam. Scope 3 includes indirect emissions such as the extraction and production of purchased materials and fuels, transport-related activities in vehicles not owned or controlled by the reporting entity, electricity-related activities (e.g., Transition and Distribution [T&D] losses) not covered in Scope 2, outsourced activities, and waste disposal, among other sources. For more information on the GHG Protocol, organizations should refer to the following: the following: - Greenhouse Gas Protocol Standards (http://www.ghgprotocol.org/standards) - Greenhouse Gas Protocol Calculators (https://ghgprotocol.org/calculation-tools) In the context of this metric, indirect emissions refer to GHG emissions from the generation of electricity, heat, or steam that is imported and consumed by the reporting organization. Organizations are also encouraged to report Greenhouse Gas Emissions Strategy (OI8237).
defined by: giin

Energy Generated for Use: Total
type: Concept
type: Code
has name: Energy Generated for Use: Total
has description: Amount of energy generated and consumed by the organization during the reporting period.
definition: Amount of energy generated and consumed by the organization during the reporting period.
has identifier: OI9624
notation: OI9624
had primary source: OI9624
note: Organizations should footnote all assumptions used.
scope note: This metric is intended to capture the amount of energy produced and used by the organization. For example, if an organization installed solar panels at its factory, it would report the amount of energy produced and used from those panels. To disaggregate this total by the type of energy generated for use—for example, non-renewable vs. renewable sources—report this metric disaggregated by the relevant options from Primary Energy Source (OI3781). Adding this metric to Energy Purchased: Total (OI8825) should equal the total energy consumed by the organization during the reporting period. Organizations wishing to report on the amount of energy generated for sale should use Energy Generated for Sale: Total (PI8706). In some contexts, this metric can serve as an indicator of whether the outcome being sought by an investor or organization is occurring (the WHAT dimension of impact). For more on the alignment of IRIS metrics to the five dimensions of impact, see IRIS+ and the Five Dimensions of Impact (https://iris.thegiin.org/document/iris-and-the-five-dimensions/). No single metric is sufficient to understand an impact; rather, metrics are selected as a set across all dimensions of impact. When possible, the selection of metrics to measure and describe the five dimensions should be based on best practice and evidence.
defined by: giin

Forced Labor Policy
type: Concept
type: Code
has name: Forced Labor Policy
has description: Indicates whether the organization has a written policy against forced labor and a system to monitor compliance of this policy.
definition: Indicates whether the organization has a written policy against forced labor and a system to monitor compliance of this policy.
has identifier: OI9650
notation: OI9650
had primary source: OI9650
note: Organizations should footnote the relevant details of their forced labor policy, including how it is enforced.
scope note: This metric is intended to capture the organization’s policy on forced labor, which is any work or service which individuals are forced to do against their will under the threat of punishment. Forced labor takes different forms, including debt bondage, trafficking, and other forms of modern slavery. Organizations can refer to the following source for further guidance: International Labour Organization standards on forced labor (http://www.ilo.org/global/topics/forced-labour/lang--en/index.htm).
defined by: giin

Permanent Employee Wages: Total
type: Concept
type: Code
has name: Permanent Employee Wages: Total
has description: Value of wages (including bonuses and excluding benefits) paid to all full- and part-time employees of the organization during the reporting period.
definition: Value of wages (including bonuses and excluding benefits) paid to all full- and part-time employees of the organization during the reporting period.
has identifier: OI9677
notation: OI9677
had primary source: OI9677
note: Organizations should footnote all assumptions used.
scope note: This metric is intended to capture pre-tax wages and salaries paid to the organization’s full- and part-time employees and should include neither benefits nor payroll expenses. This metric should exclude Temporary Employee Wages (OI4202).
defined by: giin

Wage Premium
type: Concept
type: Code
has name: Wage Premium
has description: Ratio of the additional average wage paid to employees of the organization compared to the average wage paid for a similar job in a similar industry or category and organization in the local market as of the end of the reporting period.
definition: Ratio of the additional average wage paid to employees of the organization compared to the average wage paid for a similar job in a similar industry or category and organization in the local market as of the end of the reporting period.
has identifier: OI9767
notation: OI9767
had primary source: OI9767
note: Organizations should footnote the specific position(s) for which the wage premium applies, as well as assumptions and sources related to the comparable position and similar organization. See usage guidance for further information.
scope note: This metric is intended to capture the extent to which the organization pays above-market wages by position. Organizations should use the average wage for the specific position analyzed. To source data points for average wages paid to employees in comparable positions at similar organizations, organizations can refer to resources issued by independent, third-party research bodies within their respective countries of operation. For example, organizations operating in the United States may refer to wage data by area and occupation published by the U.S. Bureau of Labor Statistics (http://www.bls.gov/bls/blswage.htm). Additional resources include The World Bank Group's WDR2013 Occupational Wages around the World report (http://data.worldbank.org/data-catalog/occupational-wages), WageIndicator.org (http://www.wageindicator.org/main/salary/Salarycheckers), and PayScale.com (https://www.payscale.com/), among others. In some circumstances, this metric can help describe the CONTRIBUTION an enterprise likely had to the degree of change (depth) in outcome that the stakeholders experienced, relative to what the market or social system would have done anyway. For more on the alignment of IRIS metrics to the five dimensions of impact, see IRIS+ and the Five Dimensions of Impact (https://iris.thegiin.org/document/iris-and-the-five-dimensions/). No single metric is sufficient to understand an impact; rather, metrics are selected as a set across all dimensions of impact. When possible, the selection of metrics to measure and describe the five dimensions should be based on best practice and evidence.
defined by: giin

Greenhouse Gas Emissions Mitigation Types
type: Concept
type: Code
has name: Greenhouse Gas Emissions Mitigation Types
has identifier: OI9839
notation: OI9839
had primary source: OI9839
note: Organizations should footnote all assumptions used, including source of data.
scope note: This metric is intended to capture the different types of GHG emissions mitigation. Organizations should use this metric in conjunction with Greenhouse Gas Emissions Mitigated: Total (OI5951), the sum of GHG emissions sequestered and avoided or reduced by the organization during the reporting period. The American Carbon Registry (ACR) develops standards for categorizing ways in which greenhouse gas emissions can be reduced, avoided, and sequestered across organizations’ operational footprint. For more information, see the ACR Standards (https://americancarbonregistry.org/carbon-accounting/standards-methodologies). For GHG emissions related to products, organizations may refer to Greenhouse Gas Emissions of Product (PD9427) and Greenhouse Gas Emissions of Product Replaced (PD2243). Additional IRIS metrics exist for the following types of emissions mitigation included in this metric: Greenhouse Gas Emissions Avoided Due to Carbon Offsets Purchased (OI6774) and Greenhouse Gas Emissions Avoided Due to Carbon Offsets Sold (PI2787).
has description: Describes types of greenhouse gas (GHG) emissions mitigation applied by the organization during the reporting period. Choose all that apply: - GHG emission reductions from fuel combustion - GHG emission reductions from industrial processes (non-combustion, chemical reaction, fugitive, other) - GHG emission reductions from land use, land use change, and forestry - GHG emissions reductions from livestock - GHG emissions reductions from waste handling and disposal - GHG emissions avoided from product replacements - GHG emissions avoided due to carbon offsets sold - GHG emissions avoided due to carbon offsets purchased - GHG emissions sequestered from land use, land use change, and forestry - GHG emissions sequestered from Carbon Capture and Storage - Other (describe)
definition: Describes types of greenhouse gas (GHG) emissions mitigation applied by the organization during the reporting period. Choose all that apply: - GHG emission reductions from fuel combustion - GHG emission reductions from industrial processes (non-combustion, chemical reaction, fugitive, other) - GHG emission reductions from land use, land use change, and forestry - GHG emissions reductions from livestock - GHG emissions reductions from waste handling and disposal - GHG emissions avoided from product replacements - GHG emissions avoided due to carbon offsets sold - GHG emissions avoided due to carbon offsets purchased - GHG emissions sequestered from land use, land use change, and forestry - GHG emissions sequestered from Carbon Capture and Storage - Other (describe)
defined by: giin

Waste Disposed: Composted
type: Concept
type: Code
has name: Waste Disposed: Composted
has description: Amount of waste disposed by the organization through composting during the reporting period.
definition: Amount of waste disposed by the organization through composting during the reporting period.
has identifier: OI9847
notation: OI9847
had primary source: OI9847
note: Organizations should footnote all assumptions used.
scope note: This metric is intended to capture the amount of waste the organization composted during the reporting period. In some contexts, this metric can serve as an indicator of whether the outcome being sought by an investor or organization is occurring (the WHAT dimension of impact). For more on the alignment of IRIS metrics to the five dimensions of impact, see IRIS+ and the Five Dimensions of Impact (https://iris.thegiin.org/document/iris-and-the-five-dimensions/). No single metric is sufficient to understand an impact; rather, metrics are selected as a set across all dimensions of impact. When possible, the selection of metrics to measure and describe the five dimensions should be based on best practice and evidence.
defined by: giin

Pesticide Use
type: Concept
type: Code
has name: Pesticide Use
has description: Amount of pesticides used during the reporting period on land area directly controlled by the organization.
definition: Amount of pesticides used during the reporting period on land area directly controlled by the organization.
has identifier: OI9891
notation: OI9891
had primary source: OI9891
note: Organizations should footnote the classification of pesticides used by hazard level, as listed by the World Health Organization’s (WHO) Acute Toxicity Hazard Categories. Organizations should also footnote the source of data. See glossary term and usage guidance for further information.
scope note: This metric is intended to capture the quantity of pesticides used during the reporting period on land directly controlled by the organization. Pesticide use refers to the use of insecticides, fungicides, herbicides, disinfectants, and any other substance intended to prevent, destroy, attract, repel, or control any pest, including unwanted species of plants or animals, during the production, storage, transport, distribution, and processing of food, agricultural commodities, and animal feeds that may be administered to animals for the control of parasites. Organizations can refer to the glossary for additional information on pesticide use and the WHO Acute Toxicity Hazard Categories. Organizations that use WHO Class Ia (extremely hazardous) and Ib (highly hazardous) pesticides should footnote additional details on the relevant land (for example, area applied and crops present) and pesticide use.
defined by: giin

Part-time Wages: Total
type: Concept
type: Code
has name: Part-time Wages: Total
has description: Value of wages (including bonuses and excluding benefits) paid to all part-time employees of the organization during the reporting period.
definition: Value of wages (including bonuses and excluding benefits) paid to all part-time employees of the organization during the reporting period.
has identifier: OI9948
notation: OI9948
had primary source: OI9948
note: Organizations should footnote all assumptions used.
scope note: This metric is intended to capture pre-tax wages and salaries paid to the organization's part-time employees and should include neither benefits nor payroll expenses. This metric should exclude Temporary Employee Wages (OI4202).
defined by: giin

Part-time Wages: Historically Marginalized
type: Concept
type: Code
has name: Part-time Wages: Historically Marginalized
has description: Value of wages (including bonuses and excluding benefits) paid to all part-time employees of the organization during the reporting period who belong to groups historically marginalized on the basis of race and/or ethnicity.
definition: Value of wages (including bonuses and excluding benefits) paid to all part-time employees of the organization during the reporting period who belong to groups historically marginalized on the basis of race and/or ethnicity.
has identifier: OI9956
notation: OI9956
had primary source: OI9956
note: Organizations should footnote all assumptions used, including their categorization of historically marginalized groups. See usage guidance for further information.
scope note: This metric is intended to capture pre-tax wages and salaries paid to the organization's part-time employees who belong to historically marginalized groups and should include neither benefits nor payroll expenses. This metric should exclude Temporary Employee Wages (OI4202). The categorization of historically marginalized groups varies with location and context. With no internationally agreed-upon definition as to which groups constitute historically marginalized on the basis of race and/or ethnicity, if well-established local policies exist (as in South Africa, with the Broad Based Black Economic Empowerment [BBBEE] definition of historically marginalized, or in India, based on backward caste), organizations should refer to these local guidelines to identify groups historically marginalized on the basis of race and/or ethnicity. Otherwise, and wherever appropriate, organizations should provide additional detail regarding their tailored methodology for defining these groups.
defined by: giin

Learning Environment Quality Assessment
type: Concept
type: Code
has name: Learning Environment Quality Assessment
has description: Describes whether the organization has assessed the quality of the learning environment for children or learners who used the organization's products/services as of the end of the reporting period.
definition: Describes whether the organization has assessed the quality of the learning environment for children or learners who used the organization's products/services as of the end of the reporting period.
has identifier: PD0754
notation: PD0754
had primary source: PD0754
note: Organizations should footnote all assumptions used, including which tools or methodologies were used to assess the quality of the learning environment. Organizations are also encouraged to footnote details about the frequency with which they conduct such assessments.
scope note: This metric is intended to capture whether the organization has evaluated the quality of the learning environment it provides. Organizations should use existing, validated processes or structural measures, such as Early Childhood Environment Rating Scale, or ECERS (https://ers.fpg.unc.edu/scales-early-childhood-environment-rating-scale-third-edition); Family Child Care Environment Rating Scale, or FCCERS (https://www.ersi.info/fccers.html); Classroom Assessment Scoring System, or CLASS (https://teachstone.com/class/); or the StimQ-Preschool (https://med.nyu.edu/pediatrics/developmental/sites/default/files/developmental/stimqp_manual.pdf), to assess quality in home or childcare environments, selecting such measures as suit the specific project context.
defined by: giin

Setting of Housing/Community Facilities
type: Concept
type: Code
has name: Setting of Housing/Community Facilities
has identifier: PD1007
notation: PD1007
had primary source: PD1007
note: Organizations should footnote details and descriptions of the types and locations of community development or housing units constructed or preserved (especially if selecting "Other").
scope note: This metric is intended to capture the setting of housing units constructed or preserved in both single-and multi-family buildings. This metric may help describe the WHO dimension of impact, which details which stakeholders the investment or enterprise aims to reach with the outcome. This metric may also help clarify how underserved they were prior to the investment. For more on the alignment of IRIS metrics to the five dimensions of impact, see IRIS+ and the Five Dimensions of Impact (https://iris.thegiin.org/document/iris-and-the-five-dimensions/). No single metric is sufficient to understand an impact; rather, metrics are selected as a set across all dimensions of impact. When possible, the selection of metrics to measure and describe the five dimensions should be based on best practice and evidence.
has description: Describes the setting of community development facilities or housing units projected to be constructed or preserved as a result of investments made by the organization during the reporting period. Choose all that apply: - Urban - Rural - Peri-urban - Other
definition: Describes the setting of community development facilities or housing units projected to be constructed or preserved as a result of investments made by the organization during the reporting period. Choose all that apply: - Urban - Rural - Peri-urban - Other
defined by: giin

Connection Type
type: Concept
type: Code
has name: Connection Type
has identifier: PD1310
notation: PD1310
had primary source: PD1310
note: Organizations should footnote all assumptions used.
scope note: This metric is intended to capture the type of connections to utilities and other services provided to households or businesses as a result of the organization’s activities. Organizations may use this metric to disaggregate Number of Household or Business Connections (PI8053). For example, disaggregating Number of Household or Business Connections (PI8053) by Connection Type (PD1310), option "Piped Water," would yield the number of piped water connections provided by the organization to households or businesses during the reporting period.
has description: Describes the type of connection provided to households or individuals as a result of the organization's activities during the reporting period. Choose all that apply: - Piped water - Sewer - Grid electricity - Off-grid electricity - Internet - Phone: Mobile - Phone: Landline - Other (describe)
definition: Describes the type of connection provided to households or individuals as a result of the organization's activities during the reporting period. Choose all that apply: - Piped water - Sewer - Grid electricity - Off-grid electricity - Internet - Phone: Mobile - Phone: Landline - Other (describe)
defined by: giin

Parent/Community-Teacher Engagement
type: Concept
type: Code
has name: Parent/Community-Teacher Engagement
has description: NOTE: this metric has been discontinued.
definition: NOTE: this metric has been discontinued.
has identifier: PD1392
notation: PD1392
had primary source: PD1392
note: Organizations should footnote descriptive details about the engagement(s).
scope note: This metric is intended to capture context on the relationship between teachers and parents of students or the broader community. Organizations are encouraged to report the frequency and nature of parental and community engagement with teachers in their annual or impact reports. For example, the National Parent Teacher Association in the United States discloses the number and nature of teacher and parental activities every year.
defined by: giin

Water Provision Capacity of Products Sold: Potable
type: Concept
type: Code
has name: Water Provision Capacity of Products Sold: Potable
has description: Volume of potential potable water provided over the lifetimes of all products sold during the reporting period.
definition: Volume of potential potable water provided over the lifetimes of all products sold during the reporting period.
has identifier: PD1403
notation: PD1403
had primary source: PD1403
note: Organizations should footnote all assumptions used.
scope note: This metric is intended to capture the total potential lifetime potable water produced or provided by products sold during the reporting period. For example, an organization that sells home water pumps that provide homeowners with drinking water should report the total potable water the pump can deliver over its expected lifetime. Potable water is safe enough for human consumption or use for domestic purposes, drinking, cooking, and personal hygiene with low risk of immediate or long-term harm. When multiplying the potable water provision capacity of each product sold by Units/Volume Sold: Total (PI1263), organizations should, under Units/Volume Sold: Total (PI1263), use the absolute number of product units sold rather than the volume of potable water provided by the product.
defined by: giin

Energy Capacity of Products Sold
type: Concept
type: Code
has name: Energy Capacity of Products Sold
has description: Amount of energy potentially generated over the lifetime of products sold by the organization during the reporting period.
definition: Amount of energy potentially generated over the lifetime of products sold by the organization during the reporting period.
has identifier: PD1504
notation: PD1504
had primary source: PD1504
note: Organizations should footnote the energy type(s) and all assumptions used to determine the energy capacity.
scope note: This metric is intended to capture the total product-lifetime energy that could be generated by products that the organization sold during the reporting period. It most applies to products that will be operated or used by a client of the organization (as opposed to the organization itself). Organizations should report Energy Capacity of Product (PD2713) for each relevant energy-generating product and disaggregate Units/Volume Sold: Total (PI1263) by product. When multiplying the energy capacity of each product sold by Units/Volume Sold: Total (PI1263), organizations should, under Units/Volume Sold: Total (PI1263), use the absolute number of product units sold rather than the volume of energy delivered by the product.
defined by: giin

Product/Service Detailed Type
type: Concept
type: Code
has name: Product/Service Detailed Type
has description: Describes the type of product or service provided by the organization in detail. Select from the options in the Reference List tab.
definition: Describes the type of product or service provided by the organization in detail. Select from the options in the Reference List tab.
has identifier: PD1516
notation: PD1516
had primary source: PD1516
note: Organizations should footnote all assumptions used.
scope note: This metric is intended to capture a detailed description of the product or service provided from among the options given in the definition. Organizations can report on this metric at an organizational level (selecting all product/service details that apply) or for a specific product/service (selecting the product/service detail for which the organization is reporting). Organizations providing water, sanitation, and hygiene (WASH) services may use this metric in conjunction with WASH Facilities Type (PD3668) to more specifically describe the facilities provided to target stakeholders through their investments.
defined by: giin

Unit of Measure
type: Concept
type: Code
has name: Unit of Measure
has identifier: PD1602
notation: PD1602
had primary source: PD1602
note: Organizations should footnote the unit of measure for each product/service for which data are reported, as well as the actual unit of measure used for reporting if they select "Other."
scope note: This metric is intended to capture in which unit of measure another metric reports. For example, if reporting units sold for two crops, one with sales volume measured in pounds and another with sales volume measured in tons, the organization should separately provide the unit of measure and units sold for each crop. This metric is intended to be reported in conjunction with other relevant IRIS metrics. Organizations can filter on the "Reporting Format" column to see those metrics that require indicating Unit of Measure (PD1602).
has description: Describes the unit of measure for reporting products or services sold, produced, exported, or installed by the organization. Select one: - British thermal units (Btu) - Gigawatt hours (GWh) - Hectares - Hours - Joules - Kilograms - Kilometers (Km) - Kilowatt-hours (kWh) - Licenses - Liters - Pounds - Quintiles - Square feet - Square meters - Tons - Other Note: Several metrics are reported in conjunction with this metric, such as Units/Volume Sold: Total (PI1263).
definition: Describes the unit of measure for reporting products or services sold, produced, exported, or installed by the organization. Select one: - British thermal units (Btu) - Gigawatt hours (GWh) - Hectares - Hours - Joules - Kilograms - Kilometers (Km) - Kilowatt-hours (kWh) - Licenses - Liters - Pounds - Quintiles - Square feet - Square meters - Tons - Other Note: Several metrics are reported in conjunction with this metric, such as Units/Volume Sold: Total (PI1263).
defined by: giin

Crop Type
type: Concept
type: Code
has name: Crop Type
has description: Type(s) of crop produced by the organization during the reporting period. Select from the options in the Reference List tab.
definition: Type(s) of crop produced by the organization during the reporting period. Select from the options in the Reference List tab.
has identifier: PD1620
notation: PD1620
had primary source: PD1620
note: Organizations should footnote all assumptions used, including source of data.
scope note: This metric is intended to capture which type(s) of crop were produced by the organization during the reporting period. Organizations can report this metric at the organizational level (selecting all relevant answer options) or for a specific product or service (selecting only one crop type for the product or service for which the organization is reporting). This metric aligns to Leading Harvest (https://www.leadingharvest.org/standard) Performance Measure 7.4: Crop Diversity. The list of options in the Reference List follows guidance from the Food and Agriculture Organization (FAO) of the United Nations (http://www.fao.org/faostat/en/#data/QC).
defined by: giin

Target Area Protected Status
type: Concept
type: Code
has name: Target Area Protected Status
has identifier: PD1676
notation: PD1676
had primary source: PD1676
note: Organizations should footnote all assumptions used, including source(s) of data.
scope note: This metric is intended to capture the protected status of the area relevant to the organization’s planet-related stakeholders. This metric is equivalent to the IUCN’s Protected Area Categories (https://www.iucn.org/theme/protected-areas/publications/protected-planet-report). If selecting the option “Other,” organizations are encouraged to align to an existing, generally accepted standard classifying the target area. If doing so, organizations should footnote the classification and standard used.
has description: Describes the protected status of the land the organization seeks to benefit during the reporting period. Choose all that apply: - Strict Nature Reserve (IUCN Category 1a) - Wilderness Area (IUCN Category Ib) - National Park (IUCN Category II) - Natural Monument or Feature (IUCN Category III) - Habitat/Species Management Area (IUCN Category IV) - Protected Landscape/Seascape (IUCN Category V) - Protected Area with Sustainable Use of Natural Resources (Category VI) - No Current Protections - Other (describe)
definition: Describes the protected status of the land the organization seeks to benefit during the reporting period. Choose all that apply: - Strict Nature Reserve (IUCN Category 1a) - Wilderness Area (IUCN Category Ib) - National Park (IUCN Category II) - Natural Monument or Feature (IUCN Category III) - Habitat/Species Management Area (IUCN Category IV) - Protected Landscape/Seascape (IUCN Category V) - Protected Area with Sustainable Use of Natural Resources (Category VI) - No Current Protections - Other (describe)
defined by: giin

Compulsory Insurance Products
type: Concept
type: Code
has name: Compulsory Insurance Products
has description: Describes compulsory insurance products required by the organization.
definition: Describes compulsory insurance products required by the organization.
has identifier: PD1928
notation: PD1928
had primary source: PD1928
note: Organizations should footnote the required insurance products for each product/service provided. See usage guidance for further information.
scope note: This metric is intended to capture which compulsory insurance products the organization requires. Examples of compulsory insurance products to footnote include agricultural insurance, credit life insurance, and life and accident insurance, among others.
defined by: giin

Water Provision Capacity of Products Sold: Total
type: Concept
type: Code
has name: Water Provision Capacity of Products Sold: Total
has description: Volume of potential water provided over the lifetimes of all products sold during the reporting period.
definition: Volume of potential water provided over the lifetimes of all products sold during the reporting period.
has identifier: PD2020
notation: PD2020
had primary source: PD2020
note: Organizations should footnote all assumptions used.
scope note: This metric is intended to capture the total potential lifetime water produced or provided by products sold during the reporting period. For example, an organization that sells home water pumps that provide the homeowners with water should report the total water the pump can deliver over its expected lifetime. When multiplying the water provision capacity of each product sold by Units/Volume Sold: Total (PI1263), organizations should, under Units/Volume Sold: Total (PI1263), use the absolute number of product units sold rather than the volume of water provided by the product.
defined by: giin

Greenhouse Gas Emissions of Product Replaced
type: Concept
type: Code
has name: Greenhouse Gas Emissions of Product Replaced
has description: Amount of greenhouse gases (GHG) that would have been emitted by the replaced product during the lifetime of the organization's product. Organizations should use Product Lifetime (PD4587) to capture the lifetime of the product.
definition: Amount of greenhouse gases (GHG) that would have been emitted by the replaced product during the lifetime of the organization's product. Organizations should use Product Lifetime (PD4587) to capture the lifetime of the product.
has identifier: PD2243
notation: PD2243
had primary source: PD2243
note: Organizations should footnote the details on the product replaced, including source of data on its GHG emissions, along with other calculation assumptions.
scope note: This metric is intended to capture the GHG emissions of the product that is being replaced by a product from the organization, with emissions measured over the lifetime of the organization's product. For example, an organization that sells solar lights might report the product replaced as a kerosene lamp, reporting against this metric the GHG emissions from that replaced kerosene lamp over the lifetime of the organization's solar light. The Greenhouse Gas Protocol (GHG Protocol) is the most widely used international accounting tool to understand, quantify, and manage greenhouse gas emissions. For more information on the GHG Protocol, organizations should refer to the following: - Greenhouse Gas Protocol Standards (http://www.ghgprotocol.org/standards) - Greenhouse Gas Protocol Calculators (https://ghgprotocol.org/calculation-tools) In some circumstances, this metric can help describe the CONTRIBUTION an enterprise likely had to the degree of change (depth) in outcome that the stakeholders experienced, relative to what the market or social system would have done anyway. For more on the alignment of IRIS metrics to the five dimensions of impact, see IRIS+ and the Five Dimensions of Impact (https://iris.thegiin.org/document/iris-and-the-five-dimensions/). No single metric is sufficient to understand an impact; rather, metrics are selected as a set across all dimensions of impact. When possible, the selection of metrics to measure and describe the five dimensions should be based on best practice and evidence.
defined by: giin

Packaging Type
type: Concept
type: Code
has name: Packaging Type
has identifier: PD2285
notation: PD2285
had primary source: PD2285
note: Organizations should footnote all assumptions used.
scope note: This metric is intended to capture the type(s) of packaging materials—a key source of waste, with potential negative environmental consequences—used by the organization during the reporting period. Organizations are encouraged to report this metric in conjunction with Packaging Weight (PI1422) for each type of packaging. Organizations are also encouraged to footnote whether the packaging includes clear messaging around the environmental implications of and recycling options for the packaging. For example, organizations using cardboard boxes may note that the boxes are reusable and recyclable, as well as compostable, if relevant.
has description: Type of packaging used by the organization during the reporting period. Select all that apply: - Recycled materials - Non-recycled compostable or renewable materials - Non-recycled, non-compostable, non-renewable materials
definition: Type of packaging used by the organization during the reporting period. Select all that apply: - Recycled materials - Non-recycled compostable or renewable materials - Non-recycled, non-compostable, non-renewable materials
defined by: giin

Housing Type
type: Concept
type: Code
has name: Housing Type
has identifier: PD2532
notation: PD2532
had primary source: PD2532
note: Organizations should footnote details and descriptions of the types of housing units constructed or preserved (especially if selecting "Other").
scope note: This metric is intended to capture the type of housing units constructed or preserved in both single- and multi-family buildings. In some contexts, this metric can serve as an indicator of whether the outcome being sought by an investor or organization is occurring (the WHAT dimension of impact). For more on the alignment of IRIS metrics to the five dimensions of impact, see IRIS+ and the Five Dimensions of Impact (https://iris.thegiin.org/document/iris-and-the-five-dimensions/). No single metric is sufficient to understand an impact; rather, metrics are selected as a set across all dimensions of impact. The selection of metrics to measure and describe the five dimensions should be based on best practice and evidence.
has description: Describes the type of housing units projected to be constructed or preserved as a result of investments made by the organization during the reporting period. Choose all that apply: Rent or Sale: - Rent - Sale Number of bedrooms: - Studio - 1-Bedroom - 2-Bedroom - 3-Bedroom - 4-Bedroom - 5-Bedroom - Other
definition: Describes the type of housing units projected to be constructed or preserved as a result of investments made by the organization during the reporting period. Choose all that apply: Rent or Sale: - Rent - Sale Number of bedrooms: - Studio - 1-Bedroom - 2-Bedroom - 3-Bedroom - 4-Bedroom - 5-Bedroom - Other
defined by: giin

Target Stakeholder Socioeconomics
type: Concept
type: Code
has name: Target Stakeholder Socioeconomics
has identifier: PD2541
notation: PD2541
had primary source: PD2541
note: Organizations should footnote further details about the types of stakeholder socioeconomics they target, including their working definition of the poverty line, as well as the groups they target if they select "Other." See usage guidance for further information.
scope note: This metric is intended to capture the socioeconomic details of the target stakeholders of the organization's activities. Organizations can benefit people and the planet throughout their supply and distribution chains, by providing products or services, and through their operations. "Lower income" is defined according to a consumption-based approach to measuring poverty, specifically including individuals or households living below a recognized poverty line that establishes the minimum available expenditure that would meet a household’s basic needs. Organizations should prefer to define this threshold based on a national poverty line set by the national government. If such a benchmark is unavailable, organizations can use the international USD 3.20 per person per day expenditure at 2011 Purchasing Power Parity (PPP), as defined by the World Bank. In either case, organizations should footnote their definition of the poverty threshold and its source. "Lower middle-income" and "Upper middle-income" thresholds are defined per capita by the World Bank each year in PPP-adjusted current dollars (https://www.worldbank.org/en/country/mic/overview#1). Organizations should footnote the threshold used, the PPP adjustment applied, and any household size assumptions, if applicable. If selecting the option "Other," organizations are encouraged to align to an existing, generally accepted standard or classification of the target socioeconomic group. If doing so, organizations should footnote the classification or standard used. This metric may help describe the WHO dimension of impact, which details which stakeholders the investment or enterprise aims to reach with the outcome. This metric may also help clarify how underserved they were prior to the investment. For more on the alignment of IRIS metrics to the five dimensions of impact, see IRIS+ and the Five Dimensions of Impact (https://iris.thegiin.org/document/iris-and-the-five-dimensions/). No single metric is sufficient to unde…
has description: Describes the socioeconomic groups of stakeholders targeted by the organization as of the end of the reporting period. Choose all that apply: - Lower-income - Lower middle-income - Upper middle-income - Other (describe)
definition: Describes the socioeconomic groups of stakeholders targeted by the organization as of the end of the reporting period. Choose all that apply: - Lower-income - Lower middle-income - Upper middle-income - Other (describe)
defined by: giin

Species Area of Habitat
type: Concept
type: Code
has name: Species Area of Habitat
has description: Describes the area of habitat available to a species within that species' range during the reporting period.
definition: Describes the area of habitat available to a species within that species' range during the reporting period.
has identifier: PD2584
notation: PD2584
had primary source: PD2584
note: Organizations should footnote all assumptions used, including source of data.
scope note: This metric is intended to capture the area of habitat available to a species within that species' range. It is also known as the extent of suitable habitat. Organizations should reference an accepted database that leverages geographic information systems (GIS) to delineate species' area of habitat. The IUCN Red List is one such database. Area of habitat is usually based off an already-mapped range for that species. Therefore, to use this metric, organizations are typically not required to collect bespoke data. After ascertaining a species’ area of habitat, organizations can cross-reference this metric with Land Directly Controlled: Total (OI5408) or Land Indirectly Controlled: Total (PI3789) to better understand the effect of its activities.
defined by: giin

Client Locations
type: Concept
type: Code
has name: Client Locations
has description: NOTE: This metric has been discontinued. Previous definition: Countries where the organization's products/services are purchased/used. Select from the options in the Reference List tab.
definition: NOTE: This metric has been discontinued. Previous definition: Countries where the organization's products/services are purchased/used. Select from the options in the Reference List tab.
has identifier: PD2587
notation: PD2587
had primary source: PD2587
scope note: This metric is intended to capture the countries where the organization’s products and services are purchased or used.
defined by: giin

Interest Rate Method
type: Concept
type: Code
has name: Interest Rate Method
has identifier: PD2691
notation: PD2691
had primary source: PD2691
note: Organizations that use multiple methods should footnote the products to which each method applies.
scope note: This metric is intended to capture the interest calculation(s) used by the organization. Amounts of interest payment depend on both the stated interest rate and the method used to calculate it. With the declining balance method, also known as the reducing balance method, interest is charged only on the product amount that the borrower still holds. With the flat rate method, interest is charged on the full, original product amount throughout the entire product term. This metric is not intended to capture amortization schedules on debt products (e.g., straight line, declining balance, bullet, balloon, increasing balance, or others).
has description: Describes the method(s) used by the organization to state the interest rate of its products. Select all that apply: - Declining balance method - Flat interest method
definition: Describes the method(s) used by the organization to state the interest rate of its products. Select all that apply: - Declining balance method - Flat interest method
defined by: giin

Energy Capacity of Product
type: Concept
type: Code
has name: Energy Capacity of Product
has description: Amount of energy potentially generated over the lifetime of a product based on its planned operation and context.
definition: Amount of energy potentially generated over the lifetime of a product based on its planned operation and context.
has identifier: PD2713
notation: PD2713
had primary source: PD2713
note: Organizations should footnote the energy type(s) and all assumptions used to determine the energy capacity.
scope note: This metric is intended to capture the energy that could be generated by the product during its lifetime. It most applies to products that will be operated or used by a client of the organization (as opposed to the organization itself). Organizations with oversight of product use beyond the initial sale should consider reporting against Energy Generated for Sale: Total (PI8706). This metric is intended to capture the lifetime energy capacity of a single product. Organizations interested in reporting the total lifetime energy capacity of all products sold during the reporting period should report Energy Capacity of Products Sold (PD1504).
defined by: giin

Product/Service Certifications
type: Concept
type: Code
has name: Product/Service Certifications
has description: Describes third-party certifications for products/services sold by the organization that are valid as of the end of the reporting period.
definition: Describes third-party certifications for products/services sold by the organization that are valid as of the end of the reporting period.
has identifier: PD2756
notation: PD2756
had primary source: PD2756
note: Organization should footnote the certification name, certifying body, and date since the product/service has been continuously certified for all product-/service-level certifications obtained by the organization.
scope note: This metric is intended to capture third-party certifications for the organization’s products and services. Certifications must come from a third party, be based on transparent standards, and have an assurance process. The process of certification must be carried out by a recognized third-party body, independent from interested parties, which demonstrates that a product or organization complies with the requirements defined by the standards or technical specifications. Examples of such certifications include UTZ Certified, Fair Trade (WFTO fair trade standard), Common Code for the Coffee Community (C4), Rainforest Alliance agriculture certification, Marine Stewardship Council (MSC), and the Forest Stewardship Council (FSC). This metric may be reported in conjunction with Operational Certifications (OI1120) held by the organization.
defined by: giin

Target Area Ecoregion
type: Concept
type: Code
has name: Target Area Ecoregion
has identifier: PD2854
notation: PD2854
had primary source: PD2854
note: Organizations should footnote all assumptions used.
scope note: This metric is intended to capture which ecoregions are relevant to the organization’s planet-related stakeholders. This metric is equivalent to the World Wildlife Fund’s ecoregions classification (https://www.worldwildlife.org/biomes). If selecting the option “Other,” organizations are encouraged to align to an existing, generally accepted standard classifying the target ecoregion. If doing so, organizations should footnote the classification and standard used.
has description: Describes the ecoregions the organization seeks to benefit as of the end of the reporting period. Choose all that apply: Terrestrial Ecoregions - Deserts and xeric shrublands - Tropical and subtropical moist broadleaf forests - Tropical and subtropical dry broadleaf forests - Tropical and subtropical coniferous forests - Temperate broadleaf and mixed forests - Temperate coniferous forest - Boreal forests/Taiga - Tropical and subtropical grasslands, savannas and shrublands - Temperate grasslands, savannas and shrublands - Flooded grasslands and savannas - Montane grasslands and shrublands - Tundra - Mediterranean forests, woodlands, and scrubs - Mangroves - Other terrestrial ecoregion (describe) Freshwater Ecoregions - Large river ecosystems - Large river headwater ecosystems - Large river delta ecosystems - Small river ecosystems - Large lake ecosystems - Small lake ecosystems - Xeric basin ecosystems - Other freshwater ecoregion (describe) Marine Ecoregions - Polar ecoregions - Temperate shelf and seas ecoregions - Temperate upwellings - Tropical upwellings - Tropical coral - Other marine ecoregion (describe)
definition: Describes the ecoregions the organization seeks to benefit as of the end of the reporting period. Choose all that apply: Terrestrial Ecoregions - Deserts and xeric shrublands - Tropical and subtropical moist broadleaf forests - Tropical and subtropical dry broadleaf forests - Tropical and subtropical coniferous forests - Temperate broadleaf and mixed forests - Temperate coniferous forest - Boreal forests/Taiga - Tropical and subtropical grasslands, savannas and shrublands - Temperate grasslands, savannas and shrublands - Flooded grasslands and savannas - Montane grasslands and shrublands - Tundra - Mediterranean forests, woodlands, and scrubs - Mangroves - Other terrestrial ecoregion (describe) Freshwater Ecoregions - Large river ecosystems - Large river headwater ecosystems - Large river delta ecosystems - Small river ecosystems - Large lake ecosystems - Small lake ecosystems - Xeric basin ecosystems - Other freshwater ecoregion (describe) Marine Ecoregions - Polar ecoregions - Temperate shelf and seas ecoregions - Temperate upwellings - Tropical upwellings - Tropical coral - Other marine ecoregion (describe)
defined by: giin

Product/Service Type
type: Concept
type: Code
has name: Product/Service Type
has identifier: PD3017
notation: PD3017
had primary source: PD3017
note: Organizations should footnote details of how their products/services fall within the selected primary categories of economic activity. See usage guidance for further information.
scope note: This metric is intended to capture the categories in which the organization offers products and services. These categories align with the UN International Standard Industrial Classification (ISIC) standards for economic activities (https://unstats.un.org/unsd/classifications/Econ/ISIC.cshtml), with which IRIS+ Impact Categories are aligned. For details on IRIS+ Impact Categories and Impact Themes, refer to the IRIS+ thematic taxonomy (https://iris.thegiin.org/guidance/iris-thematic-taxonomy/). Organizations can report this metric at an organizational level (selecting all primary categories of economic activity by the organization) or for a specific product/service (selecting the specific primary category of economic activity of the product/service for which the organization is reporting).
has description: Describes the categories of economic activity that define the organization's operations. Select all that apply: A. Agriculture, forestry, and fishing B. Mining and quarrying C. Manufacturing D. Electricity, gas, steam, and air conditioning supply E. Water supply; sewerage, waste management, and remediation activities F. Construction G. Wholesale and retail trade; repair of motor vehicles and motorcycles H. Transportation and storage I. Accommodation and food service activities J. Information and communication K. Financial and insurance activities L. Real estate activities M. Professional, scientific, and technical activities N. Administrative and support service activities O. Public administration and defense; compulsory social security P. Education Q. Human health and social work activities R. Arts, entertainment, and recreation S. Other service activities T. Activities of households as employers; undifferentiated goods and services producing activities of households for own use U. Activities of extraterritorial organizations and bodies V. Other (describe)
definition: Describes the categories of economic activity that define the organization's operations. Select all that apply: A. Agriculture, forestry, and fishing B. Mining and quarrying C. Manufacturing D. Electricity, gas, steam, and air conditioning supply E. Water supply; sewerage, waste management, and remediation activities F. Construction G. Wholesale and retail trade; repair of motor vehicles and motorcycles H. Transportation and storage I. Accommodation and food service activities J. Information and communication K. Financial and insurance activities L. Real estate activities M. Professional, scientific, and technical activities N. Administrative and support service activities O. Public administration and defense; compulsory social security P. Education Q. Human health and social work activities R. Arts, entertainment, and recreation S. Other service activities T. Activities of households as employers; undifferentiated goods and services producing activities of households for own use U. Activities of extraterritorial organizations and bodies V. Other (describe)
defined by: giin

Weighted Average Tenor of Loans Outstanding
type: Concept
type: Code
has name: Weighted Average Tenor of Loans Outstanding
has description: Weighted average tenor of loans outstanding on the organization’s balance sheet as of the end of the reporting period, measured in months.
definition: Weighted average tenor of loans outstanding on the organization’s balance sheet as of the end of the reporting period, measured in months.
has identifier: PD3079
notation: PD3079
had primary source: PD3079
note: Organizations should footnote all assumptions used.
scope note: This metric is intended to capture a weighted average life calculation of the tenor of loans that have neither been fully repaid nor written off as of the end of the reporting period. Organizations should report this weighted average tenor in months.
defined by: giin

Water Treatment Capacity of Products Sold
type: Concept
type: Code
has name: Water Treatment Capacity of Products Sold
has description: Volume of potential water treated over the lifetimes of all products sold during the reporting period.
definition: Volume of potential water treated over the lifetimes of all products sold during the reporting period.
has identifier: PD3523
notation: PD3523
had primary source: PD3523
note: Organizations should footnote all assumptions used, as well as details on the type of water treated (e.g., wastewater).
scope note: This metric is intended to capture the total, lifetime amount of water potentially treated by products sold during the reporting period. Treating water aims to improve water’s quality to make it more acceptable for an end-use, such as drinking, industry, or safe return to the environment, by removing or reducing existing water contaminants. When multiplying the water treatment capacity of each product sold by Units/Volume Sold: Total (PI1263), organizations should, under Units/Volume Sold: Total (PI1263), use the absolute number of product units sold rather than the volume of water treatment delivered by the product.
defined by: giin

Poverty Assessment
type: Concept
type: Code
has name: Poverty Assessment
has description: Indicates whether the organization assesses the poverty levels of its intended stakeholders.
definition: Indicates whether the organization assesses the poverty levels of its intended stakeholders.
has identifier: PD3569
notation: PD3569
had primary source: PD3569
note: Organizations should footnote the details of how and how often poverty levels are assessed, as well as the types of stakeholders assessed. See usage guidance for further information.
scope note: This metric is intended to capture whether the organization conducts a poverty assessment, which is often done when reducing poverty is one of the organization's social goals. Organizations can use the metric Target Stakeholders (OD7212) to indicate the type of stakeholder assessed (e.g., clients, suppliers, distributors). Because assessing the poverty level of stakeholders is complex, organizations will likely have to use specific assessment tools to accurately complete the footnoted assessments. See the glossary definition for additional information on commonly used tools to help determine the absolute poverty level of individuals and households. Additional information related to poverty assessment is also available in the SPI4 (specifically, Essential Practice 1b5). The SPI4 (http://cerise-spi4.squarespace.com/) is a social audit tool, developed for financial service providers, which applies to any organization with both social and financial objectives.
defined by: giin

WASH Facilities Type
type: Concept
type: Code
has name: WASH Facilities Type
has identifier: PD3668
notation: PD3668
had primary source: PD3668
note: Organizations should footnote all assumptions used.
scope note: This metric is intended to capture the types of WASH services available onsite at the project or investee level (for example, at a school, health center, home, or other location). Organizations should report this metric in combination with Availability of Basic Services/Facilities (PI0617) to capture the availability or quality of services provided. To capture the number of individuals who have improved access to and use of WASH services, organizations should report this metric in combination with Client Individuals: Provided New Access (PI2575) and Service Level Type (PD5205). Organizations may choose to disaggregate sanitation facilities by sewered and non-sewered offerings. For further definitions and details on what each type of WASH services includes and requires, organizations can refer to the criteria set forth in the Joint Monitoring Programme's Service Ladder for Handwashing (https://washdata.org/monitoring). For example, for menstrual hygiene waste disposal, mechanisms can include incineration or another safe method on-site, as well as safe storage and collection via a municipal waste system, as appropriate.
has description: Describes the type of water, sanitation, and hygiene (WASH) facilities available on-site as a result of the organization's activities during the reporting period. Choose all that apply: - Drinking water facilities - Handwashing facilities - Menstrual hygiene waste disposal - Sanitation facilities - Other (describe)
definition: Describes the type of water, sanitation, and hygiene (WASH) facilities available on-site as a result of the organization's activities during the reporting period. Choose all that apply: - Drinking water facilities - Handwashing facilities - Menstrual hygiene waste disposal - Sanitation facilities - Other (describe)
defined by: giin

Energy Capacity
type: Concept
type: Code
has name: Energy Capacity
has description: Maximum amount of energy that the organization’s system can transmit (measured in kV) as of the end of the reporting period.
definition: Maximum amount of energy that the organization’s system can transmit (measured in kV) as of the end of the reporting period.
has identifier: PD3764
notation: PD3764
had primary source: PD3764
note: Organizations should footnote all assumptions used.
scope note: This metric is intended to capture the maximum amount of energy that the organization’s power system can transmit.
defined by: giin

Type of Land Area
type: Concept
type: Code
has name: Type of Land Area
has identifier: PD3922
notation: PD3922
had primary source: PD3922
note: Organizations should footnote all assumptions used.
scope note: This metric is intended to capture the types of land indirectly or directly controlled by the organization. Options are based on the Anderson Classification System (ACS) for land use and land cover. Organizations are encouraged to report this metric in conjunction with Land Directly Controlled: Total (OI5408) and Land Indirectly Controlled: Total (PI3789). This metric may help describe the WHO dimension of impact, which details which stakeholders the investment or enterprise aims to reach with the outcome. This metric may also help clarify how underserved they were prior to the investment. For more on the alignment of IRIS metrics to the five dimensions of impact, see IRIS+ and the Five Dimensions of Impact (https://iris.thegiin.org/document/iris-and-the-five-dimensions/). No single metric is sufficient to understand an impact; rather, metrics are selected as a set across all dimensions of impact. When possible, the selection of metrics to measure and describe the five dimensions should be based on best practice and evidence.
has description: Describes the type(s) of land present on hectares directly or indirectly controlled by the organization. Report for hectares controlled at any point during the reporting period. Choose all that apply: - Urban/built-up land - Agricultural land - Rangeland - Forest land - Water areas - Wetland - Barren land - Tundra - Perennial snow or ice
definition: Describes the type(s) of land present on hectares directly or indirectly controlled by the organization. Report for hectares controlled at any point during the reporting period. Choose all that apply: - Urban/built-up land - Agricultural land - Rangeland - Forest land - Water areas - Wetland - Barren land - Tundra - Perennial snow or ice
defined by: giin

Water Consumption of Product
type: Concept
type: Code
has name: Water Consumption of Product
has description: Volume of water used (consumed) over the lifetime of a product or system operated according to planned capacity.
definition: Volume of water used (consumed) over the lifetime of a product or system operated according to planned capacity.
has identifier: PD3931
notation: PD3931
had primary source: PD3931
note: Organizations should footnote all assumptions used, especially those regarding product utilization and consumption of water.
scope note: This metric is intended to capture the lifetime water consumption of an individual product, not the water consumption of all products sold within the reporting period. For example, this metric may capture the water consumption of a low-flow toilet.
defined by: giin

Hours of School Offered per Week
type: Concept
type: Code
has name: Hours of School Offered per Week
has description: Number of classroom hours offered to a representative student each week during the reporting period.
definition: Number of classroom hours offered to a representative student each week during the reporting period.
has identifier: PD4120
notation: PD4120
had primary source: PD4120
note: Organizations should footnote all assumptions used.
scope note: This metric is intended to capture the number of instructional hours offered to students each week during the reporting period. In an example of how this metric might be calculated, suppose a school begins the day at 8:00am and ends at 2:00pm. Each day approximately one hour is spent on lunch, breaks, or other non-classroom learning time. Therefore, each day, each student is offered five hours of instruction. Students attend school five days per week. The reporting organization would then report 5 × 5 = 25 hours. This metric differs from Learning Hours (PI1836) in that this metric captures school time offered, while Learning Hours (PI1836) captures actual time provided. For example, if a calculation as above yields 25 hours for this metric, but within the reporting period school was cancelled for four hours in total because of snow or other bad weather, in that case would Learning Hours (PI1836) = (25 hours × number of weeks in the reporting period) - 4 hours.
defined by: giin

Supplier Locations
type: Concept
type: Code
has name: Supplier Locations
has description: Countries where the organization's suppliers are located. Select from the options in the Reference List tab.
definition: Countries where the organization's suppliers are located. Select from the options in the Reference List tab.
has identifier: PD4565
notation: PD4565
had primary source: PD4565
note: Organizations should footnote all assumptions used, including the threshold at which they report suppliers.
scope note: This metric is intended to capture the country-level locations of the organization’s suppliers. Organizations can themselves determine the precise threshold at which they report suppliers. In most cases, organizations should include only those enterprises supplying goods and services that are fundamental to the operations of the reporting organization.
defined by: giin

Energy Storage Device Cycle Life
type: Concept
type: Code
has name: Energy Storage Device Cycle Life
has description: Number of cycles that the organization’s energy storage product can be charged and discharged over its lifetime as of the end of the reporting period, measured as cumulative energy (MWh or MJ).
definition: Number of cycles that the organization’s energy storage product can be charged and discharged over its lifetime as of the end of the reporting period, measured as cumulative energy (MWh or MJ).
has identifier: PD4577
notation: PD4577
had primary source: PD4577
note: Organizations should footnote the method used for estimating the cycle life, the scope of technology to which this metric applies, and all other assumptions used.
scope note: This metric is intended to capture an energy storage technology’s useful life. Organizations can estimate cycle life based on battery chemistry or through testing. The operating lifetime of batteries is calculated as the number of times the battery can be fully charged and discharged, or “cycles,” until 20% capacity degradation occurs. This metric is aligned to and based on SASB RR-FC-410a.5. Average operating lifetime of batteries, by product application and technology type. This metric captures a product’s life in terms of the number of cycles. To capture the lifetime of a product in years, organizations should report Product Lifetime (PD4587).
defined by: giin

Product Lifetime
type: Concept
type: Code
has name: Product Lifetime
has description: Number of years of useful life of the product provided by the organization (based on reasonable use).
definition: Number of years of useful life of the product provided by the organization (based on reasonable use).
has identifier: PD4587
notation: PD4587
had primary source: PD4587
note: Organizations should footnote the method used for estimating product lifespan. See usage guidance for further information.
scope note: This metric is intended to capture the useful life of the organization’s product. Product lifetime refers to the length of time for which it is estimated that the product will perform its intended functions, assuming reasonable use. Examples of methods for estimating product lifespan, to footnote, include research and development, field testing, and customer surveys.
defined by: giin

Livestock/Fish Type
type: Concept
type: Code
has name: Livestock/Fish Type
has description: Type of livestock product(s) produced by the organization during the reporting period. Choose all that apply from the options in the Reference List.
definition: Type of livestock product(s) produced by the organization during the reporting period. Choose all that apply from the options in the Reference List.
has identifier: PD4686
notation: PD4686
had primary source: PD4686
note: Organizations should footnote all assumptions used, including source of data and reporting level. See usage guidance for further information.
scope note: This metric is intended to capture the types of livestock an organization produces. Organizations may report on this metric at the organizational level (selecting all relevant answer options) or for a specific product/service (selecting only one livestock/fish type for the product/service for which the organization is reporting). Different livestock products have different production methods and therefore different influences on ecosystems, biodiversity, climate change, and local communities. For example, carbon dioxide emissions from honey production differ from cattle breeding emissions, with correspondingly different contributions to climate change. The list of options in the Reference List is from the Food and Agriculture Organization (FAO) of the United Nations (http://unstats.un.org/unsd/cr/registry/regcst.asp?Cl=27).
defined by: giin

Product/Service Replaced Description
type: Concept
type: Code
has name: Product/Service Replaced Description
has description: Describes the product or service replaced for clients, households, or businesses by the products or services provided by the organization.
definition: Describes the product or service replaced for clients, households, or businesses by the products or services provided by the organization.
has identifier: PD4861
notation: PD4861
had primary source: PD4861
note: Organizations should footnote all assumptions used.
scope note: This metric is intended to capture a description of the product or service the organization replaces. This metric aligns to, and can be reported in conjunction with, Product/Service Description (PD7899), Product/Service Type (PD3017), and Product/Service Detailed Type (PD1516).
defined by: giin

Energy Savings from Services Sold
type: Concept
type: Code
has name: Energy Savings from Services Sold
has description: Amount of energy savings due to the organization's services that were sold during the reporting period.
definition: Amount of energy savings due to the organization's services that were sold during the reporting period.
has identifier: PD4927
notation: PD4927
had primary source: PD4927
note: Organizations should footnote all assumptions used.
scope note: This metric is intended to capture the total consumer energy savings as a result of services provided by the organization to help conserve or reduce clients' energy use. For example, an organization that helps identify products/methods that conserve energy (such as lighting retrofits, boiler system optimization, or weatherization) might report its clients‘ total energy savings under this metric. In their calculations, organizations should ensure they use the same reporting period for Client Individuals: Total (PI4060) and the average energy savings per client. In some contexts, this metric can serve as an indicator of whether the outcome being sought by an investor or organization is occurring (the WHAT dimension of impact). For more on the alignment of IRIS metrics to the five dimensions of impact, see IRIS+ and the Five Dimensions of Impact (https://iris.thegiin.org/document/iris-and-the-five-dimensions/). No single metric is sufficient to understand an impact; rather, metrics are selected as a set across all dimensions of impact. When possible, the selection of metrics to measure and describe the five dimensions should be based on best practice and evidence.
defined by: giin

Water Treatment Capacity of Product: Potable
type: Concept
type: Code
has name: Water Treatment Capacity of Product: Potable
has description: Volume of water treated to become potable over the lifetime of a product or system operated according to planned capacity.
definition: Volume of water treated to become potable over the lifetime of a product or system operated according to planned capacity.
has identifier: PD5087
notation: PD5087
had primary source: PD5087
note: Organizations should footnote all assumptions used, as well as details on the type of water treated (e.g., wastewater).
scope note: This metric is intended to capture the amount of water that could be treated to become potable by a product during its lifetime. Treating water aims to improve water’s quality to make it more acceptable for an end-use, such as drinking, industry, or safe return to the environment, by removing or reducing existing water contaminants.
defined by: giin

Other Financial Services Offered
type: Concept
type: Code
has name: Other Financial Services Offered
has description: Describes the types of financial services the organization offers in addition to core credit, savings, and insurance products.
definition: Describes the types of financial services the organization offers in addition to core credit, savings, and insurance products.
has identifier: PD5098
notation: PD5098
had primary source: PD5098
note: Organizations should footnote details on these additional service offerings and their uptake. See usage guidance for further information.
scope note: This metric is intended to capture details of the types of additional financial services offered by the organization beyond credit, savings, or insurance. Examples of additional services, to footnote, could include card products (such as debit, credit, or pre-paid), credit or financial counseling, micro-leasing, mobile banking services, payment services (by check, payroll cards, or other), remittance services, savings facilitation services, and scholarship or educational grants, among others.
defined by: giin

Service Level Type
type: Concept
type: Code
has name: Service Level Type
has identifier: PD5205
notation: PD5205
had primary source: PD5205
note: Organizations should footnote all assumptions used, including source of data.
scope note: This metric is intended to capture the level of access a client has to a service (for example, whether the service is subpar, limited, basic, or excellent). For further details on WASH service levels, see the Joint Monitoring Programme (https://washdata.org/monitoring). For further details on energy service levels, see the Energy Sector Management Assistance Program (ESMAP) (https://www.worldbank.org/content/dam/Worldbank/Topics/Energy%20and%20Extract/Beyond_Connections_Energy_Access_Redefined_Exec_ESMAP_2015.pdf). In some contexts, this metric can serve as an indicator of whether the outcome being sought by an investor or organization is occurring (the WHAT dimension of impact). For more on the alignment of IRIS metrics to the five dimensions of impact, see IRIS+ and the Five Dimensions of Impact (https://iris.thegiin.org/document/iris-and-the-five-dimensions/). No single metric is sufficient to understand an impact; rather, metrics are selected as a set across all dimensions of impact. The selection of metrics to measure and describe the five dimensions should be based on best practice and evidence.
has description: Describes the level of access to services provided to households or individuals as a result of the organization's activities as of the end the reporting period. Choose all that apply within the appropriate sector or service: Drinking Water - Safely managed - Basic - Limited - Unimproved - Surface water Sanitation - Safely managed - Basic - Limited - Unimproved - Open defecation Hygiene - Basic - Limited - No facility Electricity - Tier 5 (advanced access) - Tier 4 - Tier 3 - Tier 2 - Tier 1 - Tier 0 (no access)
definition: Describes the level of access to services provided to households or individuals as a result of the organization's activities as of the end the reporting period. Choose all that apply within the appropriate sector or service: Drinking Water - Safely managed - Basic - Limited - Unimproved - Surface water Sanitation - Safely managed - Basic - Limited - Unimproved - Open defecation Hygiene - Basic - Limited - No facility Electricity - Tier 5 (advanced access) - Tier 4 - Tier 3 - Tier 2 - Tier 1 - Tier 0 (no access)
defined by: giin

Energy Consumption of Product Replaced
type: Concept
type: Code
has name: Energy Consumption of Product Replaced
has description: Amount of energy that would have been consumed by the replaced product during the lifetime of the organization's product.
definition: Amount of energy that would have been consumed by the replaced product during the lifetime of the organization's product.
has identifier: PD5578
notation: PD5578
had primary source: PD5578
note: Organizations should footnote details on the product replaced, source for data on product utilization, and any other assumptions.
scope note: This metric is intended to capture energy consumed by the product replaced over the course of the lifetime of the organization's product, not over the course of the lifetime of the product that is being replaced. In some contexts, this metric can serve as an indicator of whether the outcome being sought by an investor or organization is occurring (the WHAT dimension of impact). For more on the alignment of IRIS metrics to the five dimensions of impact, see IRIS+ and the Five Dimensions of Impact (https://iris.thegiin.org/document/iris-and-the-five-dimensions/). No single metric is sufficient to understand an impact; rather, metrics are selected as a set across all dimensions of impact. When possible, the selection of metrics to measure and describe the five dimensions should be based on best practice and evidence.
defined by: giin

Product Targeted to Women
type: Concept
type: Code
has name: Product Targeted to Women
has description: Indicates whether the organization offers a product or service that disproportionately benefits women.
definition: Indicates whether the organization offers a product or service that disproportionately benefits women.
has identifier: PD5677
notation: PD5677
had primary source: PD5677
note: Organizations should footnote all assumptions used.
scope note: This metric is intended to capture whether a product specifically benefits women. To report against 2X Challenge requirements, organizations must report this metric in combination with one or more of the following metrics that detail how the product or service disproportionately benefits women: Client Individuals: Female (PI8330), Stakeholder Engagement (OI7914), Client Savings Premium (PI1748), Client Individuals: Provided New Access (PI2822), or Client Feedback System (OI5049). To fulfill 2X criteria, the selected metric(s) must clearly demonstrate that the product provides disproportionate benefit to women.
defined by: giin

Green Product/Service Type
type: Concept
type: Code
has name: Green Product/Service Type
has identifier: PD5694
notation: PD5694
had primary source: PD5694
note: Organizations should footnote all assumptions used, including source of data or disaggregation and any other disaggregations applied.
scope note: This metric is intended to capture a description of the contributions to a more environmentally sustainable economy offered by a product or service. Organizations can report this metric at an organizational level (selecting all product/services that apply) or for a specific product/service (selecting the product/service for which the organization is reporting). Organizations are encouraged to footnote the details of how the product or service contributes to a more environmentally sustainable economy. The options in the definition align with the EU Taxonomy for Sustainable Activities (https://ec.europa.eu/info/business-economy-euro/banking-and-finance/sustainable-finance/eu-taxonomy-sustainable-activities_en). This disaggregation, applied to another metric, is intended to capture the share of that metric which relates to products or services matching the selected options in the description. For example, the disaggregation "Climate change mitigation" when applied to Units/Volume Sold (PI1263) would include the number of products sold that mitigate climate change. The same disaggregation applied to Client Individuals (PI4060) would include the number of individuals using products or services that mitigate climate change.
has description: Describes how a product/service provided by the organization contributes to a more environmentally sustainable economy, or disaggregates another metric in terms of how the related product or service contributes to a more environmentally sustainable economy. Select all that apply: - Climate change mitigation - Climate change adaptation - The sustainable use and protection of water and marine resources - The transition to a circular economy - Pollution prevention and control - The protection and restoration of biodiversity and ecosystems - Product/service does not contribute to a more environmentally sustainable economy - Other (write-in)
definition: Describes how a product/service provided by the organization contributes to a more environmentally sustainable economy, or disaggregates another metric in terms of how the related product or service contributes to a more environmentally sustainable economy. Select all that apply: - Climate change mitigation - Climate change adaptation - The sustainable use and protection of water and marine resources - The transition to a circular economy - Pollution prevention and control - The protection and restoration of biodiversity and ecosystems - Product/service does not contribute to a more environmentally sustainable economy - Other (write-in)
defined by: giin

Target Stakeholder Demographic
type: Concept
type: Code
has name: Target Stakeholder Demographic
has identifier: PD5752
notation: PD5752
had primary source: PD5752
note: Organizations should footnote further details about the types of stakeholder(s) they target.
scope note: This metric is intended to capture the basic demographic groups of target stakeholders of an organization's products, services, and operations. A target stakeholder can be a client, employee, or anyone the organization is aiming to positively impact. Some organizations call a target stakeholder a ‘beneficiary.’ Target stakeholders—whether clients, employees, or others—should self-report their own demographic data to ensure accuracy, particularly for race and gender. Organizations should not assume gender for an individual and should protect vulnerable individuals in the LGBTQIA+ spectrum by reporting these data anonymously and in aggregate. Given that transwomen are women and transmen are men, this metric does not create separate segmentations for those groups. However, organizations are encouraged to create additional groupings using the write-in option as needed to capture those lived experiences that are helpful in understanding equity in outcomes. The categorization of historically marginalized groups varies with location and context. With no internationally agreed-upon definition as to which groups constitute historically marginalized, if well-established local policies exist (as in South Africa, with the Broad Based Black Economic Empowerment [BBBEE] definition, or in India, based on backward caste), organizations should refer to these local guidelines to identify groups historically marginalized on the basis of race and/or ethnicity. Otherwise, and wherever appropriate, organizations should provide additional detail regarding their tailored methodology for defining these groups. This metric may help describe the WHO dimension of impact, which details which stakeholders the investment or enterprise aims to reach with the outcome. This metric may also help clarify how underserved they were prior to the investment. For more on the alignment of IRIS metrics to the five dimensions of impact, see IRIS+ and the Five Dimensions of Impact (https://iris.thegiin.org/doc…
has description: Describes the demographic groups of stakeholders targeted by the organization. Select all that apply: Age group: - Children (younger than 10 years old) - Adolescents (10 years of age or older but younger than 19) - Adults (19+ years old) - Elderly/older adults Gender: - Female - Male - Gender Non-Binary - Undisclosed - Other (describe) Disability Status: - Persons with disabilities - Persons without disabilities - Undisclosed Race/Ethnicity/Minority Status: - Historically marginalized groups - Dominant culture populations - Undisclosed Other target populations: - Other (describe)
definition: Describes the demographic groups of stakeholders targeted by the organization. Select all that apply: Age group: - Children (younger than 10 years old) - Adolescents (10 years of age or older but younger than 19) - Adults (19+ years old) - Elderly/older adults Gender: - Female - Male - Gender Non-Binary - Undisclosed - Other (describe) Disability Status: - Persons with disabilities - Persons without disabilities - Undisclosed Race/Ethnicity/Minority Status: - Historically marginalized groups - Dominant culture populations - Undisclosed Other target populations: - Other (describe)
defined by: giin

Water Savings from Products Sold
type: Concept
type: Code
has name: Water Savings from Products Sold
has description: Volume of water saved over the lifetimes of all products sold during the reporting period.
definition: Volume of water saved over the lifetimes of all products sold during the reporting period.
has identifier: PD5786
notation: PD5786
had primary source: PD5786
note: Organizations should footnote all assumptions used.
scope note: This metric is intended to capture the product-lifetime water savings to consumers from their purchase of the organization’s water-efficient products. When multiplying the savings from each product sold by Units/Volume Sold: Total (PI1263), organizations should, under Units/Volume Sold: Total (PI1263), use the absolute number of product units sold rather than the volume of savings delivered by the product. In some contexts, this metric can serve as an indicator of whether the outcome being sought by an investor or organization is occurring (the WHAT dimension of impact). For more on the alignment of IRIS metrics to the five dimensions of impact, see IRIS+ and the Five Dimensions of Impact (https://iris.thegiin.org/document/iris-and-the-five-dimensions/). No single metric is sufficient to understand an impact; rather, metrics are selected as a set across all dimensions of impact. When possible, the selection of metrics to measure and describe the five dimensions should be based on best practice and evidence.
defined by: giin

Percent Affordable Housing
type: Concept
type: Code
has name: Percent Affordable Housing
has description: Percentage of the housing units projected to be constructed or preserved as a result of investments made by the organization during the reporting period that are considered affordable housing.
definition: Percentage of the housing units projected to be constructed or preserved as a result of investments made by the organization during the reporting period that are considered affordable housing.
has identifier: PD5833
notation: PD5833
had primary source: PD5833
note: Organizations should footnote the assumptions used in defining affordable housing. See usage guidance for further information.
scope note: This metric is intended to capture the percentage of housing units created or preserved as a result of an organization's investments that are affordable housing, in both single- and multi-family buildings. Affordable housing has associated financial costs for occupants at a level that does not threaten or compromise their enjoyment of other human rights and basic needs and that represents a reasonable proportion of an individual's overall income. Organizations should footnote their assumptions in defining affordable housing. In the United States, the Department of Housing and Urban Development defines affordable housing (http://portal.hud.gov/hudportal/HUD?src=/program_offices/comm_planning/affordable housing/) as that for which the occupant or occupants pays or pay no more than 30% of their income for gross housing costs, including utilities.
defined by: giin

Water Provision Capacity of Product: Total
type: Concept
type: Code
has name: Water Provision Capacity of Product: Total
has description: Volume of water provided over the lifetime of a product or system operated according to planned capacity.
definition: Volume of water provided over the lifetime of a product or system operated according to planned capacity.
has identifier: PD6052
notation: PD6052
had primary source: PD6052
note: Organizations should footnote all assumptions used.
scope note: This metric is intended to capture the amount of water that a product could produce or provide during its lifetime. For example, an organization that sells home water pumps might report the amount of water provided to the end user over a pump’s lifetime. Organizations with oversight of product use beyond the initial sale should consider reporting Water Savings from Products Sold (PD5786). Organizations wishing to report the total water production capacity of all products sold during the reporting period should report Water Provision Capacity of Products Sold: Total (PD2020).
defined by: giin

Savings Account Incentives
type: Concept
type: Code
has name: Savings Account Incentives
has description: Describes the types of incentives the organization offers to clients to establish savings accounts.
definition: Describes the types of incentives the organization offers to clients to establish savings accounts.
has identifier: PD6343
notation: PD6343
had primary source: PD6343
note: Organizations should footnote details on the types of incentives provided.
scope note: This metric is intended to capture any incentives the organization offers for savings accounts. Examples of savings account incentives implemented, to footnote, may include monetary one-time bonuses for clients who open a savings account or maintaining a certain balance, electronic resources and tools to support ongoing saving efforts, and increased interest rates paid on savings, among other methods. Organizations that require savings accounts are encouraged to describe the details of this requirement by instead reporting against Compulsory Deposits (PD9337).
defined by: giin

Species Extinction Threat
type: Concept
type: Code
has name: Species Extinction Threat
has identifier: PD6363
notation: PD6363
had primary source: PD6363
note: Organizations should footnote all assumptions used, including source of data.
scope note: This metric is intended to capture the extinction threats facing a species. This metric aligns to the threats to species included in the IUCN Red List threat classification scheme (https://www.iucnredlist.org/resources/threat-classification-scheme).
has description: Describes applicable threats to species during the reporting period. Choose all that apply: Residential & commercial development - Housing & urban areas - Commercial & industrial areas - Tourism & recreation areas Agriculture & aquaculture - Annual & perennial non-timber crops: Shifting agriculture - Annual & perennial non-timber crops: Smallholder farming - Annual & perennial non-timber crops: Agro-industry farming - Annual & perennial non-timber crops: Scale unknown/unrecorded - Wood & pulp plantations: Small-holder plantations - Wood & pulp plantations: Agro-industry plantations - Wood & pulp plantations: Scale unknown/unrecorded - Livestock farming & ranching: Nomadic grazing - Livestock farming & ranching: Small-holder grazing, ranching or farming - Livestock farming & ranching: Agro-industry grazing, ranching or farming - Livestock farming & ranching: Scale unknown/unrecorded - Marine & freshwater aquaculture: Subsistence/artisanal aquaculture - Marine & freshwater aquaculture: Industrial aquaculture - Marine & freshwater aquaculture: Scale unknown/unrecorded Energy production & mining - Oil & gas drilling - Mining & quarrying - Renewable energy - Other energy production & mining (describe) Transportation & service corridors - Roads & railroads - Utility & service lines - Shipping lanes - Flight paths Biological resource use - Hunting & collecting terrestrial animals: Intentional use (species being assessed is the target) - Hunting & collecting terrestrial animals: Unintentional effects (species being assessed is not the target) - Hunting & collecting terrestrial animals: Persecution/control - Hunting & collecting terrestrial animals: Motivation unknown/unrecorded - Gathering terrestrial plants: Intentional use (species being assessed is the target) - Gathering terrestrial plants: Unintentional effects (species being assessed is not the target) - Gathering terrestrial plants: Persecution/control - Gathering terrestrial plants: Motivation unknown/unrecorded - L…
definition: Describes applicable threats to species during the reporting period. Choose all that apply: Residential & commercial development - Housing & urban areas - Commercial & industrial areas - Tourism & recreation areas Agriculture & aquaculture - Annual & perennial non-timber crops: Shifting agriculture - Annual & perennial non-timber crops: Smallholder farming - Annual & perennial non-timber crops: Agro-industry farming - Annual & perennial non-timber crops: Scale unknown/unrecorded - Wood & pulp plantations: Small-holder plantations - Wood & pulp plantations: Agro-industry plantations - Wood & pulp plantations: Scale unknown/unrecorded - Livestock farming & ranching: Nomadic grazing - Livestock farming & ranching: Small-holder grazing, ranching or farming - Livestock farming & ranching: Agro-industry grazing, ranching or farming - Livestock farming & ranching: Scale unknown/unrecorded - Marine & freshwater aquaculture: Subsistence/artisanal aquaculture - Marine & freshwater aquaculture: Industrial aquaculture - Marine & freshwater aquaculture: Scale unknown/unrecorded Energy production & mining - Oil & gas drilling - Mining & quarrying - Renewable energy - Other energy production & mining (describe) Transportation & service corridors - Roads & railroads - Utility & service lines - Shipping lanes - Flight paths Biological resource use - Hunting & collecting terrestrial animals: Intentional use (species being assessed is the target) - Hunting & collecting terrestrial animals: Unintentional effects (species being assessed is not the target) - Hunting & collecting terrestrial animals: Persecution/control - Hunting & collecting terrestrial animals: Motivation unknown/unrecorded - Gathering terrestrial plants: Intentional use (species being assessed is the target) - Gathering terrestrial plants: Unintentional effects (species being assessed is not the target) - Gathering terrestrial plants: Persecution/control - Gathering terrestrial plants: Motivation unknown/unrecorded - L…
defined by: giin

Target Stakeholder Setting
type: Concept
type: Code
has name: Target Stakeholder Setting
has identifier: PD6384
notation: PD6384
had primary source: PD6384
note: Organizations should footnote further details about the types of stakeholder setting(s) they target.
scope note: This metric is intended to capture the basic geographic settings of the target stakeholders of an organization's products, services, and operations. For details on the geographic settings of target stakeholders, organizations can use Target Stakeholder Geography (PD6424). This metric may help describe the WHO dimension of impact, which details which stakeholders the investment or enterprise aims to reach with the outcome. This metric may also help clarify how underserved they were prior to the investment. For more on the alignment of IRIS metrics to the five dimensions of impact, see IRIS+ and the Five Dimensions of Impact (https://iris.thegiin.org/document/iris-and-the-five-dimensions/). No single metric is sufficient to understand an impact; rather, metrics are selected as a set across all dimensions of impact. When possible, the selection of metrics to measure and describe the five dimensions should be based on best practice and evidence.
has description: Describes the setting of the groups of stakeholders targeted by the organization. Select all that apply: - Rural - Urban - Peri-urban
definition: Describes the setting of the groups of stakeholders targeted by the organization. Select all that apply: - Rural - Urban - Peri-urban
defined by: giin

Target Stakeholder Geography
type: Concept
type: Code
has name: Target Stakeholder Geography
has identifier: PD6424
notation: PD6424
had primary source: PD6424
note: Organizations should footnote further details about the specific region(s) they target.
scope note: This metric is intended to capture the geography of target stakeholders. It is not intended to capture the organization's location, which is reported under Location of Organization's Headquarters (OD6855). This metric may help describe the WHO dimension of impact, which details which stakeholders the investment or enterprise aims to reach with the outcome. This metric may also help clarify how underserved they were prior to the investment. For more on the alignment of IRIS metrics to the five dimensions of impact, refer to the IRIS+ guidance document: IRIS+ and the Five Dimensions of Impact. No single metric is sufficient to understand an impact; rather, metrics are selected as a set across all dimensions of impact. When possible, the selection of metrics to measure and describe the five dimensions should be based on best practice and evidence.
has description: Describes the geography of stakeholders targeted by the organization, expressed by country, as of the end of the reporting period. Choose all that apply: - Afghanistan - Albania - Algeria - Andorra - Angola - Anguilla - Antigua & Barbuda - Argentina - Armenia - Australia - Austria - Azerbaijan - Bahamas - Bahrain - Bangladesh - Barbados - Belarus - Belgium - Belize - Benin - Bermuda - Bhutan - Bolivia - Bosnia & Herzegovina - Botswana - Brazil - Brunei Darussalam - Bulgaria - Burkina Faso - Myanmar (Burma) - Burundi - Cambodia - Cameroon - Canada - Cape Verde - Cayman Islands - Central African Republic - Chad - Chile - China - Colombia - Comoros - Costa Rica - Croatia - Cuba - Cyprus - Czech Republic - Democratic Republic of the Congo - Denmark - Djibouti - Dominica - Dominican Republic - Ecuador - Egypt - El Salvador - Equatorial Guinea - Eritrea - Estonia - Ethiopia - Fiji - Finland - France - French Guiana - Gabon - Gambia - Georgia - Germany - Ghana - Great Britain - Greece - Grenada - Guadeloupe - Guatemala - Guinea - Guinea-Bissau - Guyana - Haiti - Honduras - Hungary - Iceland - India - Indonesia - Iran - Iraq - Israel and the Occupied Territories - Italy - Ivory Coast (Côte d'Ivoire) - Jamaica - Japan - Jordan - Kazakhstan - Kenya - Kosovo - Kuwait - Kyrgyzstan - Laos - Latvia - Lebanon - Lesotho - Liberia - Libya - Liechtenstein - Lithuania - Luxembourg - Republic of Macedonia - Madagascar - Malawi - Malaysia - Maldives - Mali - Malta - Martinique - Mauritania - Mauritius - Mayotte - Mexico - Moldova - Monaco - Mongolia - Montenegro - Montserrat - Morocco - Mozambique - Namibia - Nepal - Netherlands - New Zealand - Nicaragua - Niger - Nigeria - North Korea - Norway - Oman - Pacific Islands - Pakistan - Panama - Papua New Guinea - Paraguay - Peru - Philippines - Poland - Portugal - Puerto Rico - Qatar - Réunion - Romania - Russian Federation - Rwanda - Saint Kitts and Nevis - Saint Lucia - Saint Vincent & the Grenadines - Samoa - São Tomê and Príncipe - Saud…
definition: Describes the geography of stakeholders targeted by the organization, expressed by country, as of the end of the reporting period. Choose all that apply: - Afghanistan - Albania - Algeria - Andorra - Angola - Anguilla - Antigua & Barbuda - Argentina - Armenia - Australia - Austria - Azerbaijan - Bahamas - Bahrain - Bangladesh - Barbados - Belarus - Belgium - Belize - Benin - Bermuda - Bhutan - Bolivia - Bosnia & Herzegovina - Botswana - Brazil - Brunei Darussalam - Bulgaria - Burkina Faso - Myanmar (Burma) - Burundi - Cambodia - Cameroon - Canada - Cape Verde - Cayman Islands - Central African Republic - Chad - Chile - China - Colombia - Comoros - Costa Rica - Croatia - Cuba - Cyprus - Czech Republic - Democratic Republic of the Congo - Denmark - Djibouti - Dominica - Dominican Republic - Ecuador - Egypt - El Salvador - Equatorial Guinea - Eritrea - Estonia - Ethiopia - Fiji - Finland - France - French Guiana - Gabon - Gambia - Georgia - Germany - Ghana - Great Britain - Greece - Grenada - Guadeloupe - Guatemala - Guinea - Guinea-Bissau - Guyana - Haiti - Honduras - Hungary - Iceland - India - Indonesia - Iran - Iraq - Israel and the Occupied Territories - Italy - Ivory Coast (Côte d'Ivoire) - Jamaica - Japan - Jordan - Kazakhstan - Kenya - Kosovo - Kuwait - Kyrgyzstan - Laos - Latvia - Lebanon - Lesotho - Liberia - Libya - Liechtenstein - Lithuania - Luxembourg - Republic of Macedonia - Madagascar - Malawi - Malaysia - Maldives - Mali - Malta - Martinique - Mauritania - Mauritius - Mayotte - Mexico - Moldova - Monaco - Mongolia - Montenegro - Montserrat - Morocco - Mozambique - Namibia - Nepal - Netherlands - New Zealand - Nicaragua - Niger - Nigeria - North Korea - Norway - Oman - Pacific Islands - Pakistan - Panama - Papua New Guinea - Paraguay - Peru - Philippines - Poland - Portugal - Puerto Rico - Qatar - Réunion - Romania - Russian Federation - Rwanda - Saint Kitts and Nevis - Saint Lucia - Saint Vincent & the Grenadines - Samoa - São Tomê and Príncipe - Saud…
defined by: giin

Species Conservation Status
type: Concept
type: Code
has name: Species Conservation Status
has identifier: PD6429
notation: PD6429
had primary source: PD6429
note: Organizations should footnote all assumptions used, including source of data.
scope note: This metric is intended to capture the global conservation status of a species in accordance with the IUCN Red List (https://www.iucn.org/resources/conservation-tools/iucn-red-list-threatened-species#RL_categories). Organizations should refer to the IUCN Red List Index to report on the conservation status of specific identified species. In applying this metric, organizations should begin by understanding which species' habitats are on land assessed by the organization. As a result, this metric is often used in conjunction with Species Area of Habitat (PD2584).
has description: Describes the conservation status of species during the reporting period. Choose all that apply: - Least concern - Near threatened - Vulnerable - Endangered - Critically endangered - Extinct in the wild - Extinct - Data deficient - Not evaluated
definition: Describes the conservation status of species during the reporting period. Choose all that apply: - Least concern - Near threatened - Vulnerable - Endangered - Critically endangered - Extinct in the wild - Extinct - Data deficient - Not evaluated
defined by: giin

Energy Consumption of Product
type: Concept
type: Code
has name: Energy Consumption of Product
has description: Amount of energy consumed by the product during its lifetime.
definition: Amount of energy consumed by the product during its lifetime.
has identifier: PD6596
notation: PD6596
had primary source: PD6596
note: Organizations should footnote assumptions used with respect to product utilization. See usage guidance for further information.
scope note: This metric is intended to capture energy consumed by an individual product over its lifetime, not energy consumed by the product during the reporting period. It can offer an estimate of efficiency gains associated with the product. Examples of assumptions related to product utilization, to footnote, include hours used and watts/hour used.
defined by: giin

Client State/Province/Region
type: Concept
type: Code
has name: Client State/Province/Region
has description: States or provinces where the organization's products/services are purchased/used.
definition: States or provinces where the organization's products/services are purchased/used.
has identifier: PD6806
notation: PD6806
had primary source: PD6806
scope note: This metric is intended to capture the regional geography of clients. In countries where state postal abbreviations exist, use standard and appropriate codes (e.g., New York, USA = NY or Andhra Pradesh, India = AP).
defined by: giin

Water Provision Capacity of Product: Potable
type: Concept
type: Code
has name: Water Provision Capacity of Product: Potable
has description: Volume of potable water provided over the lifetime of a product or system operated according to planned capacity.
definition: Volume of potable water provided over the lifetime of a product or system operated according to planned capacity.
has identifier: PD6929
notation: PD6929
had primary source: PD6929
note: Organizations should footnote all assumptions used.
scope note: This metric is intended to capture the amount of potable water that a product could produce or provide during its lifetime. For example, an organization that sells home water pumps might report the amount of drinking water provided to the end user over a pump’s lifetime. Potable water is safe enough for human consumption or use for domestic purposes, drinking, cooking, and personal hygiene with low risk of immediate or long-term harm.
defined by: giin

Microfinance Delivery Methodology
type: Concept
type: Code
has name: Microfinance Delivery Methodology
has identifier: PD7356
notation: PD7356
had primary source: PD7356
note: Organizations selecting ‘Other’ should footnote the type of delivery methodology they use.
scope note: This metric is intended to capture how organizations operating in microfinance (and primarily those providing lending services) deliver financial services. With an individual lending methodology, a loan is made to an individual borrower who is solely responsible for its repayment. With a solidarity group lending methodology, funds are disbursed to groups, with collection of repayment either from the group as a whole or from the individual members of that group. Borrowers in such groups often bear joint and several liability for the repayment of all loans to the group and its members. See the glossary term for additional information. With a village/self-help group lending methodology, the organization provides access to credit and savings services through group- or community-managed associations. The organization may lend to the group, which in turn uses the provided funds to lend to its members. See the glossary term for additional information. With agency banking, the organization extends their branch network to more distributed populations (e.g., rural populations) via authorized agents (branchless banking). Benefits of this methodology include cost-effectiveness, risk management, product availability, improved financial inclusion, and a wider customer base. With licensed agents, individuals or businesses are empowered to act on behalf of a financial service provider (FSP) to perform certain financial or administrative transactions. They may have a direct contractual relationship with the FSP or may be contracted by a third party (a super-agent or aggregator) that maintains a service agreement with the FSP. Roving staff/mobile branches serve customers outside of branches in their places of residence or business. They may or may not be associated with a particular branch. This methodology includes only staff or mobile units that manage deposits or handle opening customer accounts (other than loan origination). With ATMs (automated teller machines), customers access…
has description: Describes the methodologies the organization uses to deliver financial services. Select all that apply: - Individual lending - Solidarity group lending - Village/self-help group lending - Digital financial services - Agency banking - Licensed agents working on behalf of the financial service provider - Roving staff/mobile branches - ATMs - Mobile banking - Internet-based services - Merchant POS or network - Other
definition: Describes the methodologies the organization uses to deliver financial services. Select all that apply: - Individual lending - Solidarity group lending - Village/self-help group lending - Digital financial services - Agency banking - Licensed agents working on behalf of the financial service provider - Roving staff/mobile branches - ATMs - Mobile banking - Internet-based services - Merchant POS or network - Other
defined by: giin

Community Facilities Type
type: Concept
type: Code
has name: Community Facilities Type
has identifier: PD7557
notation: PD7557
had primary source: PD7557
note: Organizations should footnote details and descriptions of these facilities (especially if selecting "Other").
scope note: This metric is intended to capture the details on the community facilities that will be built, renovated, or purchased as a result of investments by the organization during the reporting period. A community facility provides services to the local community. Examples include health and medical clinics, health-treatment facilities, schools, arts and other cultural facilities, daycare facilities (adult and youth), and community sports facilities.
has description: Describes the type of community development facilities projected to be built, renovated, or purchased as a result of investments made by the organization during the reporting period. Choose all that apply: - Childcare - Education - Healthcare - Other
definition: Describes the type of community development facilities projected to be built, renovated, or purchased as a result of investments made by the organization during the reporting period. Choose all that apply: - Childcare - Education - Healthcare - Other
defined by: giin

Water Consumption of Product Replaced
type: Concept
type: Code
has name: Water Consumption of Product Replaced
has description: Average volume of water that would have been consumed by the replaced product during the lifetime of the organization's product.
definition: Average volume of water that would have been consumed by the replaced product during the lifetime of the organization's product.
has identifier: PD7621
notation: PD7621
had primary source: PD7621
note: Organizations should footnote details on the product replaced, source of data on product consumption, and any other calculation assumptions used.
scope note: This metric is intended to capture water consumed by the product replaced over the lifetime of the organization's product, not over the lifetime of the product that is being replaced. For example, this metric may be used to measure the water consumption of a conventional toilet over the expected lifetime of the organization’s water-efficient toilet product. In some circumstances, this metric can help describe the CONTRIBUTION an enterprise likely had to the degree of change (depth) in outcome that the stakeholders experienced, relative to what the market or social system would have done anyway. For more on the alignment of IRIS metrics to the five dimensions of impact, see IRIS+ and the Five Dimensions of Impact (https://iris.thegiin.org/document/iris-and-the-five-dimensions/). No single metric is sufficient to understand an impact; rather, metrics are selected as a set across all dimensions of impact. When possible, the selection of metrics to measure and describe the five dimensions should be based on best practice and evidence.
defined by: giin

Product/Service Description
type: Concept
type: Code
has name: Product/Service Description
has description: Describes (qualitatively) the product or service provided by the organization.
definition: Describes (qualitatively) the product or service provided by the organization.
has identifier: PD7899
notation: PD7899
had primary source: PD7899
scope note: This metric is intended to capture a description of the organization’s product or service offerings. This metric aligns to, and can be reported in conjunction with, Product/Service Type (PD3017) and Product/Service Detailed Type (PD1516).
defined by: giin

Environmental Policies for Financial Services Clients
type: Concept
type: Code
has name: Environmental Policies for Financial Services Clients
has description: Indicates whether the organization implements environmental policies associated with the organization’s financing practices.
definition: Indicates whether the organization implements environmental policies associated with the organization’s financing practices.
has identifier: PD7932
notation: PD7932
had primary source: PD7932
note: Organizations should footnote details on the types of policies implemented. See usage guidance for further information.
scope note: This metric is intended to capture the organization’s environmental policies for clients of its financial services. Examples of environmental policies, to footnote, include raising clients’ or enterprises’ awareness of environmental impact, training or educating clients or enterprises regarding environmental improvements, writing specific clauses into loan contracts to mitigate social and environmental risks, identifying enterprises with environmental risk, linking lines of credit to alternative forms of energy, and linking lines of credit to other environment-friendly products.
defined by: giin

Client Type
type: Concept
type: Code
has name: Client Type
has identifier: PD7993
notation: PD7993
had primary source: PD7993
note: Organizations should footnote the client type if they select "Other".
scope note: This metric is intended to capture a general description of the organization’s clients. This metric may help describe the WHO dimension of impact, which details which stakeholders the investment or enterprise aims to reach with the outcome. This metric may also help clarify how underserved they were prior to the investment. For more on the alignment of IRIS metrics to the five dimensions of impact, see IRIS+ and the Five Dimensions of Impact (https://iris.thegiin.org/document/iris-and-the-five-dimensions/). No single metric is sufficient to understand an impact; rather, metrics are selected as a set across all dimensions of impact. When possible, the selection of metrics to measure and describe the five dimensions should be based on best practice and evidence.
has description: Describes the types of entities that are buyers or recipients of the organization's products/services. Select all that apply: - Individuals - Households - Microenterprises - Small and Medium-Sized Enterprises - Large Enterprises - Nonprofit/Non-Governmental Organizations - Governmental Organizations - Other
definition: Describes the types of entities that are buyers or recipients of the organization's products/services. Select all that apply: - Individuals - Households - Microenterprises - Small and Medium-Sized Enterprises - Large Enterprises - Nonprofit/Non-Governmental Organizations - Governmental Organizations - Other
defined by: giin

Ecosystem Services Provided
type: Concept
type: Code
has name: Ecosystem Services Provided
has identifier: PD8494
notation: PD8494
had primary source: PD8494
note: Organizations should footnote details about their selections. See usage guidance for further information.
scope note: This metric is intended to capture the ecosystem services provided by land or marine area the organization directly or indirectly controls. Note that what is most critical for organizations to capture is not necessarily the long list of ecosystem services provided, but rather the key ecosystem services and their quality. Organizations may choose to identify the top 3-5 ecosystem services provided from this list, then track their changes in quality over time. The number, variety, and balance of ecosystem services is a good indicator of ecosystem health. A disproportionate share of human-induced provisioning services like crops and timber generally indicates poor ecosystem health (e.g., intensive agriculture, intensive forestry). The value of ecosystem services can be expressed in physical (e.g., amount of groundwater supplied in m³) or monetary terms. Monetary valuation of ecosystem services is complex and requires expert support but enables comparison and aggregation. Assessing ecosystem services at the site or project level uses specific tools such as InVEST or Aries and generally requires expert advice. The societal value of ecosystems is deeply related to the benefits they provide people, specifically ecosystem services, making this metric a proxy for the social value of biodiversity. Organizations are encouraged to report this metric alongside others in the Biodiversity IRIS+ Core Metrics Set, as tailored to context, that give a complementary, more complete picture of biodiversity performance. Examples of details to footnote include how the ecosystem provides the selected ecosystem services, the methodology used to measure and value the ecosystem services, information on which services were covered, and any external validation or verification conducted to evaluate the provision of the selected ecosystem services. For external validation or verification, organizations should footnote which services were covered, the date of evaluation, and the entity conducting v…
has description: Describes the ecosystem services—that is, the societal benefits of nature—provided by the ecosystem on land or marine area directly or indirectly controlled by the organization during the reporting period. Select all that apply: Provisioning Values/Services - Food - Biological raw materials - Biomass fuel - Freshwater - Genetic resources - Biochemicals, natural medicines, pharmaceuticals Regulating Values/Services - Maintenance of air quality - Regulation of climate - Regulation of water timing and flows - Erosion control - Water purification and waste treatment - Disease mitigation - Maintenance of soil quality - Pest mitigation - Pollination - Natural hazard mitigation Supporting Values/Services - Habitat - Nutrient cycling - Primary production - Water cycling Cultural Values/Services - Recreation and ecotourism - Ethical and spiritual values - Educational and inspirational values
definition: Describes the ecosystem services—that is, the societal benefits of nature—provided by the ecosystem on land or marine area directly or indirectly controlled by the organization during the reporting period. Select all that apply: Provisioning Values/Services - Food - Biological raw materials - Biomass fuel - Freshwater - Genetic resources - Biochemicals, natural medicines, pharmaceuticals Regulating Values/Services - Maintenance of air quality - Regulation of climate - Regulation of water timing and flows - Erosion control - Water purification and waste treatment - Disease mitigation - Maintenance of soil quality - Pest mitigation - Pollination - Natural hazard mitigation Supporting Values/Services - Habitat - Nutrient cycling - Primary production - Water cycling Cultural Values/Services - Recreation and ecotourism - Ethical and spiritual values - Educational and inspirational values
defined by: giin

Meter Type
type: Concept
type: Code
has name: Meter Type
has identifier: PD8501
notation: PD8501
had primary source: PD8501
note: Organizations should footnote all assumptions used.
scope note: This metric is intended to capture the type of meter—whether operating, non-operating/broken, or no meter—provided to households or individuals with utility connections during the reporting period. This metric can help assess whether households connected to a service are actually able to access that service and whether it is provided at a fair price. This metric is often used by International Finance Institutions (IFIs) as part of infrastructure analysis. In some circumstances, this metric can help describe the likelihood that the impact will be different than expected, the RISK dimension of impact. For more on the alignment of IRIS metrics to the five dimensions of impact, see IRIS+ and the Five Dimensions of Impact (https://iris.thegiin.org/document/iris-and-the-five-dimensions/). No single metric is sufficient to understand an impact; rather, metrics are selected as a set across all dimensions of impact. The selection of metrics to measure and describe the five dimensions should be based on best practice and evidence.
has description: Describes the type of meter provided to households or individuals with utility connections as a result of the organization's activities during the reporting period. Choose all that apply: - Operating meter - Non-operating/broken meter - No meter - Undisclosed
definition: Describes the type of meter provided to households or individuals with utility connections as a result of the organization's activities during the reporting period. Choose all that apply: - Operating meter - Non-operating/broken meter - No meter - Undisclosed
defined by: giin

Water Treatment Capacity of Product: Total
type: Concept
type: Code
has name: Water Treatment Capacity of Product: Total
has description: Volume of water treated over the lifetime of a product or system operated according to planned capacity.
definition: Volume of water treated over the lifetime of a product or system operated according to planned capacity.
has identifier: PD8586
notation: PD8586
had primary source: PD8586
note: Organizations should footnote all assumptions used, as well as details on the type of water treated (e.g., wastewater).
scope note: This metric is intended to capture the amount of water that could be treated by a product during its lifetime. For example, an organization might report the volume of water that a kinetic water-purifying bicycle can treat (organizations should footnote assumptions about trip time and the like when reporting the capacity of such a product). Organizations wishing to report the water-treatment capacity of all products sold during the reporting period should use Water Treatment Capacity of Products Sold (PD3523). Treating water aims to improve water’s quality to make it more acceptable for an end-use, such as drinking, industry, or safe return to the environment, by removing or reducing existing water contaminants.
defined by: giin

Days of School Offered per Year
type: Concept
type: Code
has name: Days of School Offered per Year
has description: Number of days of school offered by the organization each year.
definition: Number of days of school offered by the organization each year.
has identifier: PD8635
notation: PD8635
had primary source: PD8635
note: Organizations should footnote all assumptions used.
scope note: This metric is intended to capture the number of school days offered by the organization each year. If the reporting period is equivalent to the school year, this metric would be equal to the number of days of school offered during the reporting period.
defined by: giin

Sector of Operations
type: Concept
type: Code
has name: Sector of Operations
has identifier: PD8808
notation: PD8808
had primary source: PD8808
note: Organizations should footnote all assumptions used.
scope note: This metric is intended to capture the sector in which the organization operates. Because the category in which an organization operates (as categorized by its products/services) may differ from the categories it seeks to influence, at least two metrics are necessary to categorize an investment: respectively, Sector of Operations (PD8808) and one or both of Social Impact Objectives (OD6247) and Environmental Impact Objectives (OD4108). For example, a company that develops mobile software to inform rural farmers of real time market price data changes operates in the ICT category, but targets or influences the Agriculture sector. Thus, this organization would select "J. Information and communication" as its Sector of Operations (PD8808), and would select "Increasing Access to Agricultural Training and Information" under its Social Impact Objectives (OD6247). This list of sectors is aligned to the International Standard Industrial Classification of All Economic Activities, or ISIC (https://unstats.un.org/unsd/classifications/Econ/ISIC.cshtml). Organizations can report this metric at an organizational level (selecting all of the categories of focus for the organization) or for a specific product/service (selecting the specific category of focus of the product/service for which the organization is reporting).
has description: Describes the sector(s) in which the organization focuses its operations. Select all that apply: A. Agriculture, forestry, and fishing B. Mining and quarrying C. Manufacturing D. Electricity, gas, steam, and air conditioning supply E. Water supply; sewerage, waste management, and remediation activities F. Construction G. Wholesale and retail trade; repair of motor vehicles and motorcycles H. Transportation and storage I. Accommodation and food service activities J. Information and communication K. Financial and insurance activities L. Real estate activities M. Professional, scientific, and technical activities N. Administrative and support service activities O. Public administration and defense; compulsory social security P. Education Q. Human health and social work activities R. Arts, entertainment, and recreation S. Other service activities T. Activities of households as employers; undifferentiated goods and services producing activities of households for own use U. Activities of extraterritorial organizations and bodies V. Other (describe)
definition: Describes the sector(s) in which the organization focuses its operations. Select all that apply: A. Agriculture, forestry, and fishing B. Mining and quarrying C. Manufacturing D. Electricity, gas, steam, and air conditioning supply E. Water supply; sewerage, waste management, and remediation activities F. Construction G. Wholesale and retail trade; repair of motor vehicles and motorcycles H. Transportation and storage I. Accommodation and food service activities J. Information and communication K. Financial and insurance activities L. Real estate activities M. Professional, scientific, and technical activities N. Administrative and support service activities O. Public administration and defense; compulsory social security P. Education Q. Human health and social work activities R. Arts, entertainment, and recreation S. Other service activities T. Activities of households as employers; undifferentiated goods and services producing activities of households for own use U. Activities of extraterritorial organizations and bodies V. Other (describe)
defined by: giin

Conservation Priority Characteristics
type: Concept
type: Code
has name: Conservation Priority Characteristics
has description: Length of protected land boundary shared with the organization's protected land as of the end of the reporting period.
definition: Length of protected land boundary shared with the organization's protected land as of the end of the reporting period.
has identifier: PD9009
notation: PD9009
had primary source: PD9009
note: Organizations should footnote details about their selections. See usage guidance for further information.
scope note: This metric is intended to capture the characteristics of land the organization directly or indirectly controls that make conservation of that land a priority. Priorities depend on local conditions (e.g., species present, local communities, level of degradation). Organizations should monitor their conservation measures and gradually adjust their priorities accordingly. Nature conservation priority maps, such as MaxEnt, Nature Map, and Co$ting Nature, can provide an indication of where to act first and take into account different types of (future) land use. Examples of relevant details to footnote include, for instance, the relevant endangered or vulnerable species and other details about each selection, any third-party entities identifying the land’s conservation priority (e.g., local community, inter-governmental entity, nonprofit, or government), and the level of conservation priority. If available, organizations should cite published plans or other documentation that identifies the land as a conservation priority. Organizations are encouraged to report this metric in conjunction with Protected Land Area: Total (PI4716), Land Directly Controlled: Sustainably Managed (OI6912), Land Indirectly Controlled: Sustainably Managed (PI6796), Ecosystem Services Provided (PD8494), Length of Adjacent Protected Land (PI2135), and Area of Adjacent Protected Land (PI5750).
defined by: giin

Learning Hours Provided: Type
type: Concept
type: Code
has name: Learning Hours Provided: Type
has identifier: PD9173
notation: PD9173
had primary source: PD9173
note: Organizations should footnote all assumptions used.
scope note: This metric is intended to capture the type of learning time provided through the organization's products or services. School time is the total amount of time spent in school. Instructional time is the portion of classroom time devoted to the teaching and learning of curricular subjects. Engaged time (also known as time-on-task) refers to the portion of time during which students are paying attention to a learning task and attempting to learn. Supportive learning time, which is particularly important in early childhood, refers to time spent actively engaging with a caretaker who makes sense of and validates their learning (also known as “serve and return”). For more information on supportive learning time, see Harvard University's Center for the Developing Child (https://developingchild.harvard.edu/science/key-concepts/serve-and-return/). This metric may be used to disaggregate Learning Hours (PI1836), quantifying the types of learning time provided to students and children.
has description: Describes the type of learning time provided through the organization's products/services during the reporting period. Choose all that apply (see usage guidance for definitions): - School time - Instructional time - Engaged time/time-on-task - Supportive learning time - Other (describe)
definition: Describes the type of learning time provided through the organization's products/services during the reporting period. Choose all that apply (see usage guidance for definitions): - School time - Instructional time - Engaged time/time-on-task - Supportive learning time - Other (describe)
defined by: giin

Compulsory Deposits
type: Concept
type: Code
has name: Compulsory Deposits
has description: Indicates whether the organization requires clients to establish savings accounts.
definition: Indicates whether the organization requires clients to establish savings accounts.
has identifier: PD9337
notation: PD9337
had primary source: PD9337
note: Organizations should footnote the details of this requirement, including which clients it applies to.
scope note: This metric is intended to capture whether or not the organization requires some or all of its clients to have deposits with the organization (savings accounts).
defined by: giin

Percent Recycled Materials
type: Concept
type: Code
has name: Percent Recycled Materials
has description: Percentage of recycled materials used to manufacture the organization's products (including packaging) during the reporting period.
definition: Percentage of recycled materials used to manufacture the organization's products (including packaging) during the reporting period.
has identifier: PD9364
notation: PD9364
had primary source: PD9364
note: Organizations should footnote all assumptions used.
scope note: This metric is intended to capture the percentage of recycled materials used in manufacturing the organization's products (including packaging) during the reporting period. Recycled materials comprise processed recovered waste and may include glass, paper, metal, plastic, textiles, and electronics. Composted or other processed biodegradable waste is also considered recycled material. In some contexts, this metric can serve as an indicator of whether the outcome being sought by an investor or organization is occurring (the WHAT dimension of impact). For more on the alignment of IRIS metrics to the five dimensions of impact, see IRIS+ and the Five Dimensions of Impact (https://iris.thegiin.org/document/iris-and-the-five-dimensions/). No single metric is sufficient to understand an impact; rather, metrics are selected as a set across all dimensions of impact. When possible, the selection of metrics to measure and describe the five dimensions should be based on best practice and evidence.
defined by: giin

Greenhouse Gas Emissions of Product
type: Concept
type: Code
has name: Greenhouse Gas Emissions of Product
has description: Amount of greenhouse gases (GHG) emitted by a product over its lifetime. Organizations should use Product Lifetime (PD4587) to capture the lifetime of the product.
definition: Amount of greenhouse gases (GHG) emitted by a product over its lifetime. Organizations should use Product Lifetime (PD4587) to capture the lifetime of the product.
has identifier: PD9427
notation: PD9427
had primary source: PD9427
note: Organizations should footnote all assumptions and tools used in emissions calculation, including source of data.
scope note: This metric is intended to capture the potential GHG emissions of a product during its usable lifetime. Its calculation should not include GHG emissions related to a product’s manufacture or transport. Organizations that wish to report GHG emissions reduced as a result of a product can report against Greenhouse Gas Reductions Due to Products Sold (PI5376). The Greenhouse Gas Protocol (GHG Protocol) is the most widely used international accounting tool to understand, quantify, and manage greenhouse gas emissions. For more information on the GHG Protocol, organizations should refer to the following: - Greenhouse Gas Protocol Standards (http://www.ghgprotocol.org/standards) - Greenhouse Gas Protocol Calculators (https://ghgprotocol.org/calculation-tools) In some circumstances, this metric can help describe the CONTRIBUTION an organization likely had to the degree of change (depth) in outcome that the stakeholders experienced, relative to what the market or social system would have done anyway. For more on the alignment of IRIS metrics to the five dimensions of impact, see IRIS+ and the Five Dimensions of Impact (https://iris.thegiin.org/document/iris-and-the-five-dimensions/). No single metric is sufficient to understand an impact; rather, metrics are selected as a set across all dimensions of impact. When possible, the selection of metrics to measure and describe the five dimensions should be based on best practice and evidence.
defined by: giin

Non-financial Support Offered
type: Concept
type: Code
has name: Non-financial Support Offered
has description: Describes the type of non-financial support the organization offers to clients, if applicable.
definition: Describes the type of non-financial support the organization offers to clients, if applicable.
has identifier: PD9681
notation: PD9681
had primary source: PD9681
note: Organizations should footnote details regarding the types of services offered and their uptake. See usage guidance for further information.
scope note: This metric is intended to capture services offered by the organization to support clients other than with financial resources. Examples of services to footnote include support on topics such as education (e.g., in financial literacy, workplace safety, basic health and nutrition, for children and youth), enterprise services (e.g., business development services, enterprise skills development), female empowerment (e.g., women’s leadership training, women’s rights education and gender equality training, counseling and legal services for female victims of violence), health (e.g., basic medical services, special medical services for women and children), and housing (e.g., housing counseling, other housing-related support), among other non-financial services.
defined by: giin

Extracurricular Programs Offered
type: Concept
type: Code
has name: Extracurricular Programs Offered
has description: Describes the extracurricular activities that the organization offers to students.
definition: Describes the extracurricular activities that the organization offers to students.
has identifier: PD9759
notation: PD9759
had primary source: PD9759
note: Organizations should footnote details about the specific extracurricular programs provided. See usage guidance for further information.
scope note: This metric is intended to capture details of the extracurricular programs offered by the organization. Examples of the type of extracurricular programs that may be provided, to footnote, include arts, community service, religion, and sports.
defined by: giin

Child Developmental Assessment
type: Concept
type: Code
has name: Child Developmental Assessment
has description: Describes whether the organization has screened children who are using the organization's products/services for developmental progress and delays as of the end of the reporting period.
definition: Describes whether the organization has screened children who are using the organization's products/services for developmental progress and delays as of the end of the reporting period.
has identifier: PD9911
notation: PD9911
had primary source: PD9911
note: Organizations should footnote all assumptions used, including which tools or methodologies were used to screen children for developmental progress. Organizations are also encouraged to footnote details about the frequency with which they conduct such assessments.
scope note: This metric is intended to capture whether the organization has screened the children it serves for developmental progress. Developmental screening includes screening for learning disabilities, speech or language problems, autism, intellectual disability, emotional or behavioral conditions, hearing or vision impairment, and attention deficit/hyperactivity disorder (ADHD). To measure how many children are developmentally on track, organizations are encouraged to use Client Individuals: Total (PI4060) disaggregated by Developmental Status (PI0045).
defined by: giin

Developmental Status
type: Concept
type: Code
has name: Developmental Status
has identifier: PI0045
notation: PI0045
had primary source: PI0045
note: Organizations should footnote all assumptions used, including which tools or methodologies were used.
scope note: This metric is intended to capture the developmental status of children served by the organization, both in general and on specific areas of development, including language, executive function, and social and behavioral skills. Used alone, it describes the developmental progress of children in projects supported by the organization. Alternatively, or in addition, it may be used to disaggregate other metrics, such as Client Individuals: Total (PI4060), to calculate how many children are or are not developmentally on track. This metric, used in combination with Client Individuals: Total (PI4060), is aligned to SDG indicator 4.2.1. This metric is multi-dimensional with regard to the five dimensions of impact. In some contexts, this metric can serve as an indicator of whether the outcome being sought by an investor or organization is occurring (the WHAT dimension of impact). It may also help measure the HOW MUCH Scale dimension, which helps estimate the number of the targeted stakeholders experiencing the outcome. For more on the alignment of IRIS metrics to the five dimensions of impact, see IRIS+ and the Five Dimensions of Impact (https://iris.thegiin.org/document/iris-and-the-five-dimensions/). No single metric is sufficient to understand an impact; rather, metrics are selected as a set across all dimensions of impact. When possible, the selection of metrics to measure and describe the five dimensions should be based on best practice and evidence.
has description: Describes the developmental status of children served by the organization as of the end of the reporting period. Choose all that apply: - Developmentally on track overall - Developmentally on track in language - Developmentally on track in executive function - Developmentally on track in health - Developmentally on track in social and behavioral skills - Developmentally delayed - Other (describe)
definition: Describes the developmental status of children served by the organization as of the end of the reporting period. Choose all that apply: - Developmentally on track overall - Developmentally on track in language - Developmentally on track in executive function - Developmentally on track in health - Developmentally on track in social and behavioral skills - Developmentally delayed - Other (describe)
defined by: giin

Water Quality Standards Pass Rate
type: Concept
type: Code
has name: Water Quality Standards Pass Rate
has description: Percent of water samples at distribution or network sampling points that meet national standards for chemical water quality, residual chlorine, and microbiological contamination during the reporting period.
definition: Percent of water samples at distribution or network sampling points that meet national standards for chemical water quality, residual chlorine, and microbiological contamination during the reporting period.
has identifier: PI0478
notation: PI0478
had primary source: PI0478
note: Organizations should footnote all assumptions, including details on national standards for water quality. See usage guidance for further information.
scope note: This metric is intended to capture the percent of samples passing quality standards according to national or regional norms. Water quality affects many social and environmental outcomes, including human and ecological health. In the United States, organizations may seek further guidance on water quality standards from the Environmental Protection Agency (https://www.epa.gov/wqc/basic-information-water-quality-criteria). The World Health Organization provides additional drinking water quality standards (https://www.who.int/teams/environment-climate-change-and-health/water-sanitation-and-health/water-safety-and-quality/drinking-water-quality-guidelines). These are administrative data and should come from the service provider (for example, the utility company). This indicator aligns with IBNET 15.3-15.4 (https://www.ib-net.org/toolkit/ibnet-indicators/quality-of-service/). In some contexts, this metric can serve as an indicator of whether the outcome being sought by an investor or organization is occurring (the WHAT dimension of impact). For more on the alignment of IRIS metrics to the five dimensions of impact, see IRIS+ and the Five Dimensions of Impact (https://iris.thegiin.org/document/iris-and-the-five-dimensions/). No single metric is sufficient to understand an impact; rather, metrics are selected as a set across all dimensions of impact. The selection of metrics to measure and describe the five dimensions should be based on best practice and evidence.
defined by: giin

Availability of Basic Services/Facilities
type: Concept
type: Code
has name: Availability of Basic Services/Facilities
has description: Indicates whether basic services are present onsite, along with a system in place to maintain them, as of the end of the reporting period.
definition: Indicates whether basic services are present onsite, along with a system in place to maintain them, as of the end of the reporting period.
has identifier: PI0617
notation: PI0617
had primary source: PI0617
note: Organizations should footnote all assumptions used, including what type of basic services are available.
scope note: This metric is intended to capture whether the organization has basic services provided on premises along with a system in place to maintain them. Organizations in the WASH sector should report this metric in combination with WASH Facilities Type (PD3668). For Water, Sanitation, and Hygiene (WASH) services, this metric requires an access level of "Basic" or "Safely Managed," according to the criteria set forth in the Joint Monitoring Programme's Service Ladder for Drinking Water (https://washdata.org/monitoring/drinking-water). For more information, see Service Level Type (PD5205). For other impact goals and sectors, organizations should provide services and facilities at the basic or higher level, as defined by international standards. Organizations should footnote which standards are applied. These data are often most easily collected through site visits or surveys, with visual confirmation that improvement projects have been completed. In some contexts, this metric can serve as an indicator of whether the outcome being sought by an investor or organization is occurring (the WHAT dimension of impact). For more on the alignment of IRIS metrics to the five dimensions of impact, see IRIS+ and the Five Dimensions of Impact (https://iris.thegiin.org/document/iris-and-the-five-dimensions/). No single metric is sufficient to understand an impact; rather, metrics are selected as a set across all dimensions of impact. The selection of metrics to measure and describe the five dimensions should be based on best practice and evidence.
defined by: giin

Energy Storage Capacity
type: Concept
type: Code
has name: Energy Storage Capacity
has description: Maximum amount of energy that can be stored in the organization’s energy storage product (in MWh or MJ) as of the end of the reporting period.
definition: Maximum amount of energy that can be stored in the organization’s energy storage product (in MWh or MJ) as of the end of the reporting period.
has identifier: PI0915
notation: PI0915
had primary source: PI0915
note: Organizations should footnote all assumptions used, including the scope of technology to which this metric applies.
scope note: This metric is intended to capture the maximum potential benefit of an energy storage technology developed or deployed by the organization in terms of maximum potential energy stored without accounting for actual usage or loss rates. Reference: SASB RR-FC-410a.1.
defined by: giin

Healthcare Facilities
type: Concept
type: Code
has name: Healthcare Facilities
has description: Number of healthcare units/facilities under the organization's management as of the end of the reporting period.
definition: Number of healthcare units/facilities under the organization's management as of the end of the reporting period.
has identifier: PI1017
notation: PI1017
had primary source: PI1017
note: Organizations should footnote all assumptions used.
scope note: This metric is intended to capture the number of healthcare facilities managed by the organization. Organizations are encouraged to report the number and design of facilities built in their operations manual or impact report. Organizations should also align their facility counts with state or international standards.
defined by: giin

Energy Discharge Rate
type: Concept
type: Code
has name: Energy Discharge Rate
has description: Average discharge rate of the organization’s storage product , measured as the energy storage capacity divided by the discharge time, during the reporting period.
definition: Average discharge rate of the organization’s storage product , measured as the energy storage capacity divided by the discharge time, during the reporting period.
has identifier: PI1022
notation: PI1022
had primary source: PI1022
note: Organizations should footnote all assumptions used, including the scope of technology to which this metric applies.
scope note: This metric is intended to capture the speed of discharge for an energy storage technology developed or deployed by the organization, a proxy for energy availability.
defined by: giin

Distributor Organizations: Total
type: Concept
type: Code
has name: Distributor Organizations: Total
has description: Number of enterprises that served as distributors of the organization's products/services during the reporting period.
definition: Number of enterprises that served as distributors of the organization's products/services during the reporting period.
has identifier: PI1060
notation: PI1060
had primary source: PI1060
note: Organizations should footnote all assumptions used.
scope note: This metric is intended to capture how many organizations sold the organization's products or services during the reporting period, either to other distributors (wholesale) or to ultimate consumers (retail). Distributors counted under this metric need not exclusively sell the organization’s products or services. Organizations wishing to report on individuals who are distributors should instead use Distributor Individuals: Total (PI2758) and its associated submetrics. This metric is multi-dimensional with regard to the five dimensions of impact: it may help describe the WHO dimension when the stakeholder group represented by the metric is the stakeholder group targeted by the investment or organization. It may also help measure the HOW MUCH Scale dimension, which helps estimate the number of the targeted stakeholders experiencing the outcome. For more on the alignment of IRIS metrics to the five dimensions of impact, see IRIS+ and the Five Dimensions of Impact (https://iris.thegiin.org/document/iris-and-the-five-dimensions/). No single metric is sufficient to understand an impact; rather, metrics are selected as a set across all dimensions of impact. When possible, the selection of metrics to measure and describe the five dimensions should be based on best practice and evidence.
defined by: giin

School Enrollment: Female
type: Concept
type: Code
has name: School Enrollment: Female
has description: Number of female students enrolled as of the end of the reporting period, both full- and part-time, with each discrete student counted once regardless of their number of courses.
definition: Number of female students enrolled as of the end of the reporting period, both full- and part-time, with each discrete student counted once regardless of their number of courses.
has identifier: PI1081
notation: PI1081
had primary source: PI1081
note: Organizations should footnote all assumptions used, as well as a breakdown of full- and part-time female students.
scope note: This metric is intended to capture the number of female students enrolled at the school as of the end of the reporting period, including both full- and part-time students. Each discrete student is counted once, regardless of the number of courses taken. These data may be most effectively collected through either school reporting (for private schools) or government reporting (for public schools). This metric is multi-dimensional with regard to the five dimensions of impact. It may help describe the WHO dimension when the stakeholder group represented by the metric is the stakeholder group targeted by the investment or organization. It may also help measure the HOW MUCH Scale dimension, which helps estimate the number of the targeted stakeholders experiencing the outcome. For more on the alignment of IRIS metrics to the five dimensions of impact, see IRIS+ and the Five Dimensions of Impact (https://iris.thegiin.org/document/iris-and-the-five-dimensions/). No single metric is sufficient to understand an impact; rather, metrics are selected as a set across all dimensions of impact. When possible, the selection of metrics to measure and describe the five dimensions should be based on best practice and evidence.
defined by: giin

Student Transportation
type: Concept
type: Code
has name: Student Transportation
has description: Indicates if the organization provided transportation to students that needed or requested it during the reporting period.
definition: Indicates if the organization provided transportation to students that needed or requested it during the reporting period.
has identifier: PI1136
notation: PI1136
had primary source: PI1136
note: Organizations should footnote the type of transportation provided and the percentage of students that use it.
scope note: This metric is intended to capture whether the organization provided transportation to students who requested or needed it. Organizations are also encouraged to footnote details on the service provided, such as the number of students who were provided transportation, eligibility criteria, bus capacity and ridership, and safety details.
defined by: giin

Distributor Individuals: Disabilities
type: Concept
type: Code
has name: Distributor Individuals: Disabilities
has description: Number of individuals with disabilities who served as distributors of the organization’s products/services during the reporting period.
definition: Number of individuals with disabilities who served as distributors of the organization’s products/services during the reporting period.
has identifier: PI1160
notation: PI1160
had primary source: PI1160
note: Organizations should footnote all assumptions used, as well as any specific focus on stakeholders with particular disabilities.
scope note: This metric is intended to capture how many self-employed individuals with disabilities sold the organization's products or services during the reporting period, either to other distributors (wholesale) or to ultimate consumers (retail). Distributors counted under this metric need not exclusively sell the organization's products or services. Direct employees who distribute the organization's goods or services should be considered employees, not distributors. This metric is multi-dimensional with regard to the five dimensions of impact: it may help describe the WHO dimension when the stakeholder group represented by the metric is the stakeholder group targeted by the investment or organization. It may also help measure the HOW MUCH Scale dimension, which helps estimate the number of the targeted stakeholders experiencing the outcome. For more on the alignment of IRIS metrics to the five dimensions of impact, see IRIS+ and the Five Dimensions of Impact (https://iris.thegiin.org/document/iris-and-the-five-dimensions/). No single metric is sufficient to understand an impact; rather, metrics are selected as a set across all dimensions of impact. When possible, the selection of metrics to measure and describe the five dimensions should be based on best practice and evidence.
defined by: giin

Responsible Financial Products/Services Offered
type: Concept
type: Code
has name: Responsible Financial Products/Services Offered
has description: Indicates whether the organization offers responsible financial products and services. See usage guidance for further information.
definition: Indicates whether the organization offers responsible financial products and services. See usage guidance for further information.
has identifier: PI1209
notation: PI1209
had primary source: PI1209
note: Organizations should footnote details regarding the policies in place that make the offered financial products and services responsible. Organizations may refer to footnotes under other reported metrics.
scope note: This metric is intended to capture whether the organization offers responsible financial products and services, as defined by their implementation of the following: Client Protection Policy (OI4753), Repayment Capacity Analysis (PI4733), and Non-Financial Support Offered (PD9681). While organizations should consider a broader scope of concerns around responsible financial services, organizations implementing these three policies and procedures are often presumed to be "responsible" as a working definition for the purpose of comparative analysis.
defined by: giin

Units/Volume Sold: Total
type: Concept
type: Code
has name: Units/Volume Sold: Total
has description: Amount of the product/service sold by the organization during the reporting period.
definition: Amount of the product/service sold by the organization during the reporting period.
has identifier: PI1263
notation: PI1263
had primary source: PI1263
note: Organizations should footnote all assumptions used.
scope note: This metric is intended to capture the sales volume of a product or service. Organizations that sell different types of products/services should consider reporting separately against each different product/service.
defined by: giin

Renewal Ratio
type: Concept
type: Code
has name: Renewal Ratio
has description: Percentage of the organization’s clients that stay enrolled in policies after their coverage term expires during the reporting period.
definition: Percentage of the organization’s clients that stay enrolled in policies after their coverage term expires during the reporting period.
has identifier: PI1275
notation: PI1275
had primary source: PI1275
note: Organizations should footnote all assumptions used.
scope note: This metric is intended to capture the ratio at which clients renew their insurance. As an example, a 90% renewal ratio means that for every 100 insured, 90 renew, while 10 do not. For more detail on the ratio and for guidance on its interpretation, see the Microinsurance Network’s Social Performance Indicators for Microinsurance, p. 18 (https://www.social-protection.org/gimi/ShowRessource.action?id=5270/).
defined by: giin

Units/Volume Produced
type: Concept
type: Code
has name: Units/Volume Produced
has description: Amount of the product/service produced by the organization during the reporting period.
definition: Amount of the product/service produced by the organization during the reporting period.
has identifier: PI1290
notation: PI1290
had primary source: PI1290
note: Organizations should footnote all assumptions used.
scope note: This metric is intended to capture the amount of a product that has been manufactured or cultivated by the organization during the reporting period. Organizations that sell different types of products/services should consider reporting separately against each different product/service.
defined by: giin

Individuals Displaced: Total
type: Concept
type: Code
has name: Individuals Displaced: Total
has description: Number of individuals displaced as a result of projects supported/financed by the organization during the reporting period.
definition: Number of individuals displaced as a result of projects supported/financed by the organization during the reporting period.
has identifier: PI1297
notation: PI1297
had primary source: PI1297
note: Organizations should footnote all assumptions used.
scope note: This metric is intended to capture the number of individuals (whether clients of the organization or not) displaced from their homes as a result of projects funded by the organization. For example, if the organization constructs a new road and, in the process, displaces 50 people, the value of this metric would be 50. Organizations should footnote details of the displacement. Organizations are encouraged to report this metric in conjunction with Individuals Displaced: Compensated (PI3009) to identify the number of displaced individuals who received remuneration for their displacement. For more on this topic, see EBRD’s Resettlement Guidance and Best Practice (https://www.ebrd.com/publications/resettlement-guidance-good-practice.pdf). This metric may most apply to projects involving the construction or renovation of large-scale infrastructure, as well as building projects. This metric is often used by International Finance Institutions (IFIs) as part of infrastructure analysis. This metric is multidimensional with regard to the five dimensions of impact. It may help describe the WHO dimension of impact, which details which stakeholders the investment or enterprise aims to reach with the outcome, and may also describe the HOW MUCH Scale dimension, which helps estimate the number of the targeted stakeholders experiencing the outcome. For more on the alignment of IRIS metrics to the five dimensions of impact, see IRIS+ and the Five Dimensions of Impact (https://iris.thegiin.org/document/iris-and-the-five-dimensions/). No single metric is sufficient to understand an impact; rather, metrics are selected as a set across all dimensions of impact. The selection of metrics to measure and describe the five dimensions should be based on best practice and evidence.
defined by: giin

Average Supplier Agricultural Yield: Smallholder
type: Concept
type: Code
has name: Average Supplier Agricultural Yield: Smallholder
has description: Average agricultural yield per hectare of smallholder farmers who sold to the organization during the reporting period.
definition: Average agricultural yield per hectare of smallholder farmers who sold to the organization during the reporting period.
has identifier: PI1405
notation: PI1405
had primary source: PI1405
note: Organizations should footnote all assumptions used, including source of data, details on the group, and unit of measure reporting against (such as kilograms or bushels per hectare) using Unit of Measure (PD1602). See usage guidance for further information.
scope note: NOTE: This metric will be deprecated in a forthcoming update to the IRIS Catalog of Metrics. Users are advised to instead report Average Agricultural Yield (PI5935), applied to Supplier Individuals: Smallholder (PI9991). This metric is intended to capture the average output per hectare for smallholder farmers among an organization's suppliers. Organizations should not calculate this metric using aggregate data across all smallholder suppliers. Rather, as noted in the calculation, organizations should use smallholder farmer–specific data. Organizations should report yield from the most recent harvest and footnote details on the unit of measure. This metric could be valuable for organizations that procure from farmers and provide support to improve their yields, such as training and technical assistance. Organizations interested in reporting the yields of their client farmers should report Average Client Agricultural Yield: Smallholder (PI9421). This metric is multi-dimensional with regard to the five dimensions of impact. In specific contexts, and based on evidence, this metric may serve as a proxy indicator of whether the outcome being sought by an investor or organization is occurring (the WHAT dimension of impact). This metric may also identify a specific the WHO dimension of impact, which details which stakeholders the investment or enterprise aims to reach with the outcome. This metric may also help clarify how underserved they were prior to the investment. For more on the alignment of IRIS metrics to the five dimensions of impact, see IRIS+ and the Five Dimensions of Impact (https://iris.thegiin.org/document/iris-and-the-five-dimensions/). No single metric is sufficient to understand an impact; rather, metrics are selected as a set across all dimensions of impact. When possible, the selection of metrics to measure and describe the five dimensions should be based on best practice and evidence.
defined by: giin

Target Stakeholder Spending: Housing
type: Concept
type: Code
has name: Target Stakeholder Spending: Housing
has description: Amount of money spent by the average target stakeholder on housing costs during the reporting period.
definition: Amount of money spent by the average target stakeholder on housing costs during the reporting period.
has identifier: PI1409
notation: PI1409
had primary source: PI1409
note: Organizations should footnote the type of expenditures made, including whether payments are for rent or ownership of housing, as well as all assumptions used and source of data.
scope note: This metric is intended to capture target stakeholder spending on housing. These data can be collected directly from target stakeholders (residents) or through a housing management company. If collected directly from target stakeholders through a survey, organizations should footnote details on the sample size and survey instrument used, as well as details on who administered the survey and who aggregated the resulting data. Target stakeholders are sometimes referred to as “beneficiaries” in other frameworks. In some contexts, this metric can serve as an indicator of whether the outcome being sought by an investor or organization is occurring (the WHAT dimension of impact). For more on the alignment of IRIS metrics to the five dimensions of impact, see IRIS+ and the Five Dimensions of Impact (https://iris.thegiin.org/document/iris-and-the-five-dimensions/). No single metric is sufficient to understand an impact; rather, metrics are selected as a set across all dimensions of impact. When possible, the selection of metrics to measure and describe the five dimensions should be based on best practice and evidence.
defined by: giin

Client Households: Urban
type: Concept
type: Code
has name: Client Households: Urban
has description: Number of unique households in urban areas that were clients of the organization during the reporting period.
definition: Number of unique households in urban areas that were clients of the organization during the reporting period.
has identifier: PI1417
notation: PI1417
had primary source: PI1417
note: Organizations should footnote all assumptions used, including source of data. See usage guidance for further information.
scope note: This metric is intended to capture the number of unique urban households that received the organization's products or services during the reporting period. Examples of organizations that might report against this metric include those that provide products such as clean cookstoves or water purification systems and those that provide services such as home weatherization. Organizations that provide goods and services at the individual level, such as vaccines or school lunches, may find it more appropriate to report against Client Individuals: Total (PI4060) and related submetrics. Many organizations may not be able to report on the number of client households using direct data. For example, organizations that sell water purification systems through a series of local network distributors might estimate the number of client households reached based on the number of units sold. Organizations should footnote details on how and why these assumptions were made. This metric is multi-dimensional with regard to the five dimensions of impact. It may help describe the WHO dimension when the stakeholder group represented by the metric is the stakeholder group targeted by the investment or organization. It may also help measure the HOW MUCH Scale dimension, which helps estimate the number of the targeted stakeholders experiencing the outcome. For more on the alignment of IRIS metrics to the five dimensions of impact, see IRIS+ and the Five Dimensions of Impact (https://iris.thegiin.org/document/iris-and-the-five-dimensions/). No single metric is sufficient to understand an impact; rather, metrics are selected as a set across all dimensions of impact. When possible, the selection of metrics to measure and describe the five dimensions should be based on best practice and evidence.
defined by: giin

Packaging Weight
type: Concept
type: Code
has name: Packaging Weight
has description: Weight of packaging used by the organization during the reporting period.
definition: Weight of packaging used by the organization during the reporting period.
has identifier: PI1422
notation: PI1422
had primary source: PI1422
note: Organizations should footnote all assumptions used.
scope note: This metric is intended to capture the weight of packaging used by the organization. Organizations may also wish to report Packaging Type (PD2285). Weight of packaging is a common way to measure how much packaging is used, which is relevant in assessing the environmental implications of an organization's products. This metric is based on SASB CG-HP-410a.1.
defined by: giin

Energy Stored
type: Concept
type: Code
has name: Energy Stored
has description: Amount of energy stored by the organization during the reporting period.
definition: Amount of energy stored by the organization during the reporting period.
has identifier: PI1435
notation: PI1435
had primary source: PI1435
note: Organizations should footnote all assumptions used.
scope note: This metric is intended to capture actual energy stored, not battery nameplate capacity, generally measured annually as MWh/year or MJ/year. Organizations should footnote whether the storage capacity is targeted at reducing wasted energy from existing generation or at creating storage capacity to enable new generation.
defined by: giin

Number of Loans Outstanding
type: Concept
type: Code
has name: Number of Loans Outstanding
has description: Number of disbursed loans remaining on the organization’s balance sheet as of the end of the reporting period.
definition: Number of disbursed loans remaining on the organization’s balance sheet as of the end of the reporting period.
has identifier: PI1478
notation: PI1478
had primary source: PI1478
note: Organizations should footnote all assumptions used.
scope note: This metric is intended to capture the number of loans on an organization’s balance sheet as of the end of the reporting period. Microfinance institutions (MFIs) using a group-lending methodology should count separately under this metric one loan for every individual who is responsible for repaying a portion of a group loan, unless another definition is footnoted. Organizations should report all loans disbursed to clients that have neither been fully repaid nor written off as of the end of the reporting period. For financial organizations, loans disbursed are considered Financial Assets (FP4649) listed on the organization’s balance sheet.
defined by: giin

Area of Land Deforested
type: Concept
type: Code
has name: Area of Land Deforested
has description: Area of land deforested by the organization during the reporting period.
definition: Area of land deforested by the organization during the reporting period.
has identifier: PI1489
notation: PI1489
had primary source: PI1489
note: Organizations should footnote the reasons and methods for deforestation, as well as all assumptions used. See usage guidance for further information.
scope note: This metric is intended to capture the area of land controlled or monitored by the organization that has been deforested. Above- and below-ground food networks in forests have developed over hundreds of years. Forests provide habitats for species and provide a range of ecosystem services. Their disappearance leads to loss in biodiversity, decline in soil quality (for example, erosion and nutrients), and intensification of climate change. Land may be deforested for multiple reasons and using multiple methods (e.g., clear-cutting, burning). Organizations should footnote these details. Organizations can report this metric in conjunction with Area of Land Reforested (PI4907). Organizations are encouraged to closely monitor deforestation and its causes through remote sensing data, tracking the evolution and speed of deforestation over time. Organizations should also track the consequences for forests of natural disasters, harvesting, illegal logging, and other negative outcomes.
defined by: giin

Payments to Supplier Individuals: Total
type: Concept
type: Code
has name: Payments to Supplier Individuals: Total
has description: Value of payments made by the organization to individuals who sold to the organization during the reporting period.
definition: Value of payments made by the organization to individuals who sold to the organization during the reporting period.
has identifier: PI1492
notation: PI1492
had primary source: PI1492
note: Organizations should footnote all assumptions used.
scope note: This metric is intended to capture how organizations support livelihoods through their supply chains.
defined by: giin

Units/Volume Sold: Lost/Leaked
type: Concept
type: Code
has name: Units/Volume Sold: Lost/Leaked
has description: Amount of the product/service provided by the organization for free as a result of loss or leakage during the reporting period.
definition: Amount of the product/service provided by the organization for free as a result of loss or leakage during the reporting period.
has identifier: PI1509
notation: PI1509
had primary source: PI1509
note: Organizations should footnote all assumptions used.
scope note: This metric is intended to capture the number of units or volume provided for sale—for example, of piped water or energy—that were lost, leaked, or for which no payment was received ("non-revenue") during the reporting period. These are administrative data and should come from the service provider (for example, the utility company). This metric, in combination with Water Provided for Sale: Total (PI9468), aligns with the IBNET indicator Non-Revenue Water (IBNET 6.1), which represents water that has been produced but is “lost” before it reaches the customer (whether through leaks, theft, or legal usage for which no payment is made). Some non-revenue water can be saved through appropriate technical and managerial actions. Water saved can then be used to meet currently unsatisfied demand (and hence to increase revenues to the utility) or to defer future capital expenditures in additional supply (and hence to reduce costs to the utility). For further detail, see IBNET (https://www.ib-net.org/toolkit/ibnet-indicators/non-revenue-water/). This metric also aligns with HIPSO (Harmonized Indicators for Private Sector Operations) indicators for water and energy. To meet HIPSO specifications for water, users should disaggregate this metric by commercial and technical losses. This metric may help describe the HOW MUCH Scale dimension, which helps estimate the number of the targeted stakeholders experiencing the outcome. For more on the alignment of IRIS metrics to the five dimensions of impact, see IRIS+ and the Five Dimensions of Impact (https://iris.thegiin.org/document/iris-and-the-five-dimensions/). No single metric is sufficient to understand an impact; rather, metrics are selected as a set across all dimensions of impact. The selection of metrics to measure and describe the five dimensions should be based on best practice and evidence.
defined by: giin

Disease/Condition Addressed
type: Concept
type: Code
has name: Disease/Condition Addressed
has identifier: PI1533
notation: PI1533
had primary source: PI1533
note: Organizations should footnote details about how their products and services address the selected diseases or conditions. See usage guidance for further information.
scope note: This metric is intended to capture the types of diseases and conditions addressed by organizations operating in health services. The options align with top-level ICD-11 codes from the World Health Organization (https://icd.who.int/browse11/l-m/en). Organizations that do not provide direct treatment should select the diseases or conditions that their products or services address. For example, an organization that produces and sells vaccines should choose the diseases or conditions those vaccines address. Organizations can report this metric at an organizational level (selecting all relevant answer options) or for a specific product/service (selecting only one disease or condition addressed by the product or service for which the organization is reporting).
has description: Describes the diseases or conditions addressed by the organization's products or services provided during the reporting period. Select all that apply: - 01 Certain infectious or parasitic diseases - 02 Neoplasms - 03 Diseases of the blood or blood-forming organs - 04 Diseases of the immune system - 05 Endocrine, nutritional, or metabolic diseases - 06 Mental, behavioural or neurodevelopmental disorders - 07 Sleep-wake disorders - 08 Diseases of the nervous system - 09 Diseases of the visual system - 10 Diseases of the ear or mastoid process - 11 Diseases of the circulatory system - 12 Diseases of the respiratory system - 13 Diseases of the digestive system - 14 Diseases of the skin - 15 Diseases of the musculoskeletal system or connective tissue - 16 Diseases of the genitourinary system - 17 Conditions related to sexual health - 18 Pregnancy, childbirth, or the puerperium - 19 Certain conditions originating in the perinatal period - 20 Developmental anomalies - 21 Symptoms, signs or clinical findings, not elsewhere classified - 22 Injury, poisoning or certain other consequences of external causes - 23 External causes of morbidity or mortality - 24 Factors influencing health status or contact with health services - 25 Codes for special purposes - 26 Supplementary Chapter Traditional Medicine Conditions - Module I
definition: Describes the diseases or conditions addressed by the organization's products or services provided during the reporting period. Select all that apply: - 01 Certain infectious or parasitic diseases - 02 Neoplasms - 03 Diseases of the blood or blood-forming organs - 04 Diseases of the immune system - 05 Endocrine, nutritional, or metabolic diseases - 06 Mental, behavioural or neurodevelopmental disorders - 07 Sleep-wake disorders - 08 Diseases of the nervous system - 09 Diseases of the visual system - 10 Diseases of the ear or mastoid process - 11 Diseases of the circulatory system - 12 Diseases of the respiratory system - 13 Diseases of the digestive system - 14 Diseases of the skin - 15 Diseases of the musculoskeletal system or connective tissue - 16 Diseases of the genitourinary system - 17 Conditions related to sexual health - 18 Pregnancy, childbirth, or the puerperium - 19 Certain conditions originating in the perinatal period - 20 Developmental anomalies - 21 Symptoms, signs or clinical findings, not elsewhere classified - 22 Injury, poisoning or certain other consequences of external causes - 23 External causes of morbidity or mortality - 24 Factors influencing health status or contact with health services - 25 Codes for special purposes - 26 Supplementary Chapter Traditional Medicine Conditions - Module I
defined by: giin

Producer Price Premium
type: Concept
type: Code
has name: Producer Price Premium
has description: Price premium percentage that the producer (supplier) selling to the organization obtains from the organization for its goods or services during the reporting period.
definition: Price premium percentage that the producer (supplier) selling to the organization obtains from the organization for its goods or services during the reporting period.
has identifier: PI1568
notation: PI1568
had primary source: PI1568
note: Organizations should footnote all assumptions used, including the source for the benchmark product/service rate and source of data. See usage guidance for further information.
scope note: This metric is intended to capture the price premium a producer or supplier to the organization earns, which is the percentage by which a product/service's selling price exceeds a benchmark price. The benchmark price is the average price that can be obtained for a similar product/service in the local area. An example of how this metric might be calculated follows. By selling to the organization, farmers get USD 2 per pound for a good (such as apples) compared to only USD 1 per pound for selling the same good in the local market. The reporting organization would report this as (USD 2 – USD 1) / USD 1 x 100 = 100% and would footnote assumptions with regard to how they derived the local market rate (that is, the benchmark). In some circumstances, this metric can help describe the CONTRIBUTION an organization likely had to the degree of change (depth) in outcome that the stakeholders experienced, relative to what the market or social system would have done anyway. For more on the alignment of IRIS metrics to the five dimensions of impact, see IRIS+ and the Five Dimensions of Impact (https://iris.thegiin.org/document/iris-and-the-five-dimensions/). No single metric is sufficient to understand an impact; rather, metrics are selected as a set across all dimensions of impact. When possible, the selection of metrics to measure and describe the five dimensions should be based on best practice and evidence.
defined by: giin

Client Households: Receiving Free Products/Services
type: Concept
type: Code
has name: Client Households: Receiving Free Products/Services
has description: Number of unique client households who received free products/services from the organization during the reporting period.
definition: Number of unique client households who received free products/services from the organization during the reporting period.
has identifier: PI1583
notation: PI1583
had primary source: PI1583
note: Organizations should footnote all assumptions used, including source of data. See usage guidance for further information.
scope note: This metric is intended to capture the number of unique client households that received products or services provided by the organization for which it did not request payment and for which it does not expect reimbursement. If the organization expects or receives payment from someone other than the client household, these households should be reported against Client Households: No Direct Payment (PI2180). Organizations should include the unique number of client households that received free products or services, regardless of whether or not these same households may also have paid the organization directly for certain products or services during the reporting period. Many organizations may not be able to report on the number of client households using direct data. For example, organizations that sell water purification systems through a series of local network distributors might estimate the number of client households reached based on the number of units sold. Organizations should footnote details on how and why these assumptions were made. This metric is multi-dimensional with regard to the five dimensions of impact. It may help describe the WHO dimension when the stakeholder group represented by the metric is the stakeholder group targeted by the investment or organization. It may also help measure the HOW MUCH Scale dimension, which helps estimate the number of the targeted stakeholders experiencing the outcome. For more on the alignment of IRIS metrics to the five dimensions of impact, see IRIS+ and the Five Dimensions of Impact (https://iris.thegiin.org/document/iris-and-the-five-dimensions/). No single metric is sufficient to understand an impact; rather, metrics are selected as a set across all dimensions of impact. When possible, the selection of metrics to measure and describe the five dimensions should be based on best practice and evidence.
defined by: giin

Building Area of Energy Efficiency Improvements
type: Concept
type: Code
has name: Building Area of Energy Efficiency Improvements
has description: Area of buildings projected to receive energy-efficiency improvements as a result of investments made by the organization during the reporting period.
definition: Area of buildings projected to receive energy-efficiency improvements as a result of investments made by the organization during the reporting period.
has identifier: PI1586
notation: PI1586
had primary source: PI1586
note: Organizations should footnote details on the types of energy efficiency improvements planned, as well as all assumptions used. See usage guidance for further information.
scope note: This metric is intended to capture the gross floor area of the building(s) where the organization plans to implement energy-efficiency improvements. Such projects can include efficiency improvements to lighting (lower-usage or fewer fixtures), increased building performance through improved insulation, installation of energy-efficient windows, and increased heating/cooling or appliance efficiency. Organizations are encouraged to report this metric in conjunction with the Energy Conserved (OI6697) as a result of these improvements. Organizations wishing to report on the amount of money spent on renewable energy infrastructure and technology, which may lead to the energy-efficiency improvements reported here, can use Renewable Energy Capital Expenditures (OI9206). If the energy-efficiency improvements are part of a wider energy conservation strategy or as otherwise applicable, organizations are also encouraged to report Energy Conservation Strategy (OI4531).
defined by: giin

Energy Discharged
type: Concept
type: Code
has name: Energy Discharged
has description: Amount of energy discharged (MWh or MJ) from the organization’s energy storage product during the reporting period.
definition: Amount of energy discharged (MWh or MJ) from the organization’s energy storage product during the reporting period.
has identifier: PI1595
notation: PI1595
had primary source: PI1595
note: Organizations should footnote all assumptions used, including the scope of technology to which this metric applies.
scope note: This metric is intended to capture the beneficial impact of the organization’s storage technology (whether developed or deployed) in terms of units of energy delivered during the reporting period and therefore made available to recipients.
defined by: giin

Account Value
type: Concept
type: Code
has name: Account Value
has identifier: PI1653
notation: PI1653
had primary source: PI1653
note: Organizations should footnote all assumptions used, including source of data or disaggregation and any other disaggregations applied.
scope note: This disaggregation, applied to another metric, is intended to capture the share of that metric in which the account value changed in the direction of the selected options. For example, when applied to Number of Voluntary Savings Accounts (PI6439) with the option "Increased in value during the reporting period," this disaggregation would capture the number of savings accounts which increased in value during the reporting period. Organizations should include accounts opened during the reporting period: if they have a positive balance, the account has increased in value; if they have a negative or zero balance, the account has decreased in value.
has description: Disaggregates a metric representing accounts in terms of the direction of their change in value during the reporting period. Select any that apply: - Increased in value during the reporting period - Decreased in value or stayed the same value during the reporting period - Other (write-in)
definition: Disaggregates a metric representing accounts in terms of the direction of their change in value during the reporting period. Select any that apply: - Increased in value during the reporting period - Decreased in value or stayed the same value during the reporting period - Other (write-in)
defined by: giin

Client Households: Poor
type: Concept
type: Code
has name: Client Households: Poor
has description: Number of unique poor households that were clients of the organization during the reporting period.
definition: Number of unique poor households that were clients of the organization during the reporting period.
has identifier: PI1726
notation: PI1726
had primary source: PI1726
note: Organizations should footnote all assumptions used, including source of data, as well as details on the assessment tools used to identify the poverty level of client households. See usage guidance for further information.
scope note: This metric is intended to capture the number of unique poor households that received the organization’s products or services during the reporting period. Examples of organizations that might report against this metric include those that provide products such as clean cookstoves or water purification systems and those that provide services such as home weatherization. Organizations that provide goods and services at the individual level, such as vaccines or school lunches, may find it more appropriate to report against Client Individuals: Total (PI4060) and related submetrics. Because assessing the poverty level of client households is complex, organizations will likely have to use specific assessment tools to accurately report on this metric. See the glossary definition for additional information on commonly used tools to help determine the absolute poverty level of individuals and households. Many organizations may not be able to report on the number of client households using direct data. For example, organizations that sell water purification systems through a series of local network distributors might estimate the number of client households reached based on the number of units sold. Organizations should footnote details on how and why these assumptions were made. This metric is multi-dimensional with regard to the five dimensions of impact. It may help describe the WHO dimension when the stakeholder group represented by the metric is the stakeholder group targeted by the investment or organization. It may also help measure the HOW MUCH Scale dimension, which helps estimate the number of the targeted stakeholders experiencing the outcome. For more on the alignment of IRIS metrics to the five dimensions of impact, see IRIS+ and the Five Dimensions of Impact (https://iris.thegiin.org/document/iris-and-the-five-dimensions/). No single metric is sufficient to understand an impact; rather, metrics are selected as a set across all dimensions of impact. When possible,…
defined by: giin

Supplier Individuals: Female
type: Concept
type: Code
has name: Supplier Individuals: Female
has description: Number of female individuals who sold goods or services to the organization during the reporting period.
definition: Number of female individuals who sold goods or services to the organization during the reporting period.
has identifier: PI1728
notation: PI1728
had primary source: PI1728
note: Organizations should footnote all assumptions used.
scope note: This metric is intended to capture how organizations support the livelihoods of female individuals through their supply chains. This metric is multi-dimensional with regard to the five dimensions of impact: it may help describe the WHO dimension when the stakeholder group represented by the metric is the stakeholder group targeted by the investment or organization. It may also help measure the HOW MUCH Scale dimension, which helps estimate the number of the targeted stakeholders experiencing the outcome. For more on the alignment of IRIS metrics to the five dimensions of impact, see IRIS+ and the Five Dimensions of Impact (https://iris.thegiin.org/document/iris-and-the-five-dimensions/). No single metric is sufficient to understand an impact; rather, metrics are selected as a set across all dimensions of impact. When possible, the selection of metrics to measure and describe the five dimensions should be based on best practice and evidence.
defined by: giin

Client Savings Premium
type: Concept
type: Code
has name: Client Savings Premium
has description: Percentage price savings the client obtains by purchasing a product or service from the organization and the average price that they would otherwise pay for a similar product or service in the local market.
definition: Percentage price savings the client obtains by purchasing a product or service from the organization and the average price that they would otherwise pay for a similar product or service in the local market.
has identifier: PI1748
notation: PI1748
had primary source: PI1748
note: This metric is intended to capture the price discount or savings to a client of purchasing the organization’s products or services rather than a similar product or service. For example, if the organization's product costs USD 5 and the average price for a similar product is USD 10 in the local market, this would be calculated as: (USD 10 – USD 5) / USD 10 = 50% savings. Positive numbers can be interpreted as savings to the consumer (client). In this calculation, organizations should use prices as of the end of the reporting period. In specific contexts, and based on evidence, this metric can serve as a proxy indicator of whether the outcome being sought by an investor or organization is occurring (the WHAT dimension of impact). For more on the alignment of IRIS metrics to the five dimensions of impact, see IRIS+ and the Five Dimensions of Impact (https://iris.thegiin.org/document/iris-and-the-five-dimensions/). No single metric is sufficient to understand an impact; rather, metrics are selected as a set across all dimensions of impact. When possible, the selection of metrics to measure and describe the five dimensions should be based on best practice and evidence.
scope note: This metric is intended to capture the price discount/savings as a percentage compared to a similar product/service. For example, if the organization's product costs $5 and the average price for a similar product is $10 in the local market, this would be calculated as: ($10$5)/ $10 = 0.5 or 50% savings. Positive numbers can be interpreted as savings to the consumer (client). Organizations should report these prices as of the end of the reporting period. This metric is multi-dimensional with regard to the five dimensions of impact. In some contexts, this metric can serve as an indicator of whether the outcome being sought by an investor or organization is occurring (the WHAT dimension of impact). It may also help measure the HOW MUCH Scale dimension, which helps estimate the number of the targeted stakeholders experiencing the outcome. For more on the alignment of IRIS metrics to the five dimensions of impact, see IRIS+ and the Five Dimensions of Impact (https://iris.thegiin.org/document/iris-and-the-five-dimensions/). No single metric is sufficient to understand an impact; rather, metrics are selected as a set across all dimensions of impact. When possible, the selection of metrics to measure and describe the five dimensions should be based on best practice and evidence.
defined by: giin

Sales Revenue
type: Concept
type: Code
has name: Sales Revenue
has description: Value of revenue received during the reporting period from sales of the organization’s products/services.
definition: Value of revenue received during the reporting period from sales of the organization’s products/services.
has identifier: PI1775
notation: PI1775
had primary source: PI1775
scope note: This metric is intended to capture the organization’s sales revenue, which results from the ordinary operating activities of an organization and is commonly termed earned revenue. In specific contexts, and based on evidence, this metric may serve as a proxy indicator of whether the outcome being sought by an investor or organization is occurring (the WHAT dimension of impact). For more on the alignment of IRIS metrics to the five dimensions of impact, see IRIS+ and the Five Dimensions of Impact (https://iris.thegiin.org/document/iris-and-the-five-dimensions/). No single metric is sufficient to understand an impact; rather, metrics are selected as a set across all dimensions of impact. When possible, the selection of metrics to measure and describe the five dimensions should be based on best practice and evidence.
defined by: giin

Client Individuals: No Direct Payment
type: Concept
type: Code
has name: Client Individuals: No Direct Payment
has description: Number of unique client individuals who received products/services during the reporting period, for which no direct payment was provided to the organization at the time of service but for which the organization expects to be reimbursed.
definition: Number of unique client individuals who received products/services during the reporting period, for which no direct payment was provided to the organization at the time of service but for which the organization expects to be reimbursed.
has identifier: PI1807
notation: PI1807
had primary source: PI1807
note: Organizations should footnote all assumptions used, including source of data. See usage guidance for further information.
scope note: This metric is intended to capture the number of clients who received products or services where no out-of-pocket payment was provided and for which the organization expects to be reimbursed by third parties (such as insurance). For example, if a school receives vouchers from its clients (students) for school enrollment and is later reimbursed by the government, these client individuals have made no direct payment. Organizations should include the number of unique client individuals who received products or services and made no direct payment, regardless of whether or not these clients may have also received services during the reporting period for which they made out-of-pocket payments. This metric is intended to capture the unique number of specific individuals served. Organizations should not use any household multipliers when reporting against this metric. If organizations consider entire households to be the customer/client, they can report against Client Households: Total (PI7954) and its associated submetrics. Many organizations may not be able to report on the number of clients using direct data. For example, organizations that sell solar lanterns through a series of local network distributors might estimate the number of client individuals reached based on the number of units sold. Organizations should footnote details on how and why these assumptions were made. For healthcare providers, “client individuals” refers to patients. For housing providers, “client individuals” refers to residents or tenants.
defined by: giin

Learning Hours
type: Concept
type: Code
has name: Learning Hours
has description: Number of learning hours provided to students during the reporting period.
definition: Number of learning hours provided to students during the reporting period.
has identifier: PI1836
notation: PI1836
had primary source: PI1836
note: Organizations should footnote all assumptions used, including source(s) of data.
scope note: This metric is intended to capture the number of learning hours provided to students during the reporting period. It is a measure of actual hours provided during the reporting period, not expected or projected time. In this way, this metric differs from Hours of School Provided (PD4120), which projects the number of hours of instructional time per week. For example, if students are projected to have 1,120 hours of school time during a reporting period, but school is cancelled for two days (for a total of 14 hours), organizations should report 1,106 hours for this metric. This metric may be disaggregated by Learning Hours Type (PD9173) for further detail on school time, instructional time, engaged time/time on task, and, for young children, responsive learning time. Definitions for these terms are provided in the usage guidance for Learning Hours Type (PD9173).
defined by: giin

Energy Demand Hours Type
type: Concept
type: Code
has name: Energy Demand Hours Type
has identifier: PI1845
notation: PI1845
had primary source: PI1845
note: Organizations should footnote all assumptions used.
scope note: This metric is intended to capture the time frame in which the organization operated in terms of energy demand, which shows whether the organization’s operations made energy available for peak shaving. For further detail on peak load, peak shaving, and time-of-use tariffs, see resources: - From baseload to peak: Renewables provide a reliable solution (https://www.irena.org/-/media/Files/IRENA/Agency/Publication/2015/IRENA_Baseload_to_Peak_2015.pdf) - Time-of-Use Tariffs: Innovation Landscape Brief (https://www.irena.org/-/media/Files/IRENA/Agency/Publication/2019/Feb/IRENA_Innovation_ToU_tariffs_2019.pdf?la=en&hash=36658ADA8AA98677888DB2C184D1EE6A048C7470) - International Recommendations for Energy Statistics (https://unstats.un.org/unsd/energystats/methodology/documents/IRES-web.pdf) - U.S. Energy Information Administration’s Glossary (https://www.eia.gov/tools/glossary/index.php?id=P)
has description: Describes the time frame in which the organization operated during the reporting period. Choose all that apply: - Peak - Off-Peak - Undisclosed - Other (describe)
definition: Describes the time frame in which the organization operated during the reporting period. Choose all that apply: - Peak - Off-Peak - Undisclosed - Other (describe)
defined by: giin

Payments to Supplier Organizations: Local
type: Concept
type: Code
has name: Payments to Supplier Organizations: Local
has description: Value of payments made to local enterprises that sold goods or services to the organization during the reporting period.
definition: Value of payments made to local enterprises that sold goods or services to the organization during the reporting period.
has identifier: PI1849
notation: PI1849
had primary source: PI1849
note: Organizations should footnote their definition of "local." See usage guidance for further information.
scope note: This metric is intended to capture payments made to local enterprises that supply goods or services to the reporting organization. Organizations can themselves determine the precise threshold at which they report suppliers. In most cases, organizations should include only those enterprises supplying goods and services that are fundamental to the operations of the reporting organization. Individual organizations' definitions of local will depend on their business models and impact objectives. For example, if their purpose is economic development, they may define "local" within geo-political boundaries. If they focus on reducing emissions, they may define "local" by specific distance. Organizations should not include subcontractors as part of this metric; subcontractors can be reported under Temporary Employees (OI9028) and its related submetrics.
defined by: giin

Teachers Qualified
type: Concept
type: Code
has name: Teachers Qualified
has description: Number of teachers at the organizations as of the end of the reporting period who have obtained training or have qualifications that meet or exceed the minimum requirements of the local area.
definition: Number of teachers at the organizations as of the end of the reporting period who have obtained training or have qualifications that meet or exceed the minimum requirements of the local area.
has identifier: PI1902
notation: PI1902
had primary source: PI1902
note: Organizations should footnote the minimum level of qualifications required in the local area.
scope note: This metric is intended to capture the number of teachers who have met or exceeded required qualifications as of the end of the reporting period. Organizations are encouraged to report this metric in conjunction with Teachers Employed (OI5896). This metric is multi-dimensional with regard to the five dimensions of impact. In some contexts, this metric can serve as an indicator of whether the outcome being sought by an investor or organization is occurring (the WHAT dimension of impact). It may also help measure the HOW MUCH Scale dimension, which helps estimate the number of the targeted stakeholders experiencing the outcome. For more on the alignment of IRIS metrics to the five dimensions of impact, see IRIS+ and the Five Dimensions of Impact (https://iris.thegiin.org/document/iris-and-the-five-dimensions/). No single metric is sufficient to understand an impact; rather, metrics are selected as a set across all dimensions of impact. When possible, the selection of metrics to measure and describe the five dimensions should be based on best practice and evidence.
defined by: giin

Number of Equity Investments Outstanding
type: Concept
type: Code
has name: Number of Equity Investments Outstanding
has description: Number of equity investments on the organization’s balance sheet as of the end of the reporting period.
definition: Number of equity investments on the organization’s balance sheet as of the end of the reporting period.
has identifier: PI1914
notation: PI1914
had primary source: PI1914
note: Organizations should footnote all assumptions used. See usage guidance for further information.
scope note: This metric is intended to capture equity investments made by the organization in for-profit enterprises and outstanding as of the end of the reporting period. In an equity investment, in exchange for investment funds, the organization receives an ownership interest in the equity (stock) of the enterprise, either common or preferred stock. Organizations are encouraged to footnote whether their equity is held directly in enterprises or through funds.
defined by: giin

Average Insurance Premium
type: Concept
type: Code
has name: Average Insurance Premium
has description: Average annualized insurance premium charged for a particular insurance product provided by the organization during the reporting period.
definition: Average annualized insurance premium charged for a particular insurance product provided by the organization during the reporting period.
has identifier: PI1934
notation: PI1934
had primary source: PI1934
note: Organizations should footnote all assumptions used.
scope note: This metric is intended to capture average annual spending by client individuals on insurance, a proxy of affordability. Organizations are encouraged to compare these data to historical or national averages. For example, in the United States, organizations can refer to the Henry J. Kaiser Foundation for yearly data on average annual health insurance premiums to assess affordability and access to healthcare for individuals and families. Organizations should also consider reporting Minimum Insurance Premium (PI3734).
defined by: giin

Client Individuals: Children/Adolescents
type: Concept
type: Code
has name: Client Individuals: Children/Adolescents
has description: Number of unique children and adolescents who were clients of the organization during the reporting period.
definition: Number of unique children and adolescents who were clients of the organization during the reporting period.
has identifier: PI1945
notation: PI1945
had primary source: PI1945
note: Organizations should footnote all assumptions used, including source of data. See usage guidance for further information.
scope note: This metric is intended to capture the number of unique child and adolescent clients who received the organization’s products or services during the reporting period. It is not a measure of foot traffic, nor is it intended to capture the number of consumer transactions. For example, a customer who makes two purchases during a period should be counted only once. Organizations wishing to report on total client transactions should refer to Client Transactions (PI5184). Organizations operating in health services may find it beneficial to report with greater specificity the ages of their clients. For best practice guidelines for youth classification, see the World Health Organization (http://www.who.int/hiv/pub/guidelines/arv2013/intro/keyterms/en/), which defines age ranges as follows: infant (birth to one year), child (one to 10 years), and adolescent (10 to 19 years). This metric is intended to capture the unique number of specific individuals served. Organizations should not use any household multipliers when reporting against this metric. If organizations consider entire households to be the customer/client, they can report against Client Households: Total (PI7954) and its associated submetrics. Many organizations may not be able to report on the number of clients using direct data. For example, organizations that sell solar lanterns through a series of local network distributors might estimate the number of client individuals reached based on the number of units sold. Organizations should footnote details on how and why these assumptions were made. For healthcare providers, “client individuals” refers to patients. For housing providers, “client individuals” refers to residents or tenants. This metric is multi-dimensional with regard to the five dimensions of impact. It may help describe the WHO dimension when the stakeholder group represented by the metric is the stakeholder group targeted by the investment or organization. It may also help measure the HOW MUCH Sca…
defined by: giin

Purchase Price of Product or Service Replaced
type: Concept
type: Code
has name: Purchase Price of Product or Service Replaced
has description: Indicates the average price paid in the local market by clients for a product/service that is similar to the product/service sold by the organization.
definition: Indicates the average price paid in the local market by clients for a product/service that is similar to the product/service sold by the organization.
has identifier: PI1997
notation: PI1997
had primary source: PI1997
note: Organizations should footnote all assumptions used, including how the similar, local product/service and price were selected.
scope note: This metric is intended to capture the price of a product or service currently on the market that is similar to the organization's product or service. In many contexts, this metric captures the price of a traditional or status quo product replaced by a new or improved product sold by the organization. This metric is part of the calculation for Client Savings Premium (PI1748). Organizations should report prices as of the end of the reporting period.
defined by: giin

Units/Volume Purchased from Supplier Organizations: Total
type: Concept
type: Code
has name: Units/Volume Purchased from Supplier Organizations: Total
has description: Units/volume from organizations that sold to the reporting organization during the reporting period.
definition: Units/volume from organizations that sold to the reporting organization during the reporting period.
has identifier: PI2019
notation: PI2019
had primary source: PI2019
note: Organizations should footnote all assumptions used, including source of data.
scope note: This metric is intended to capture the total units or volume an organization purchased from its supplier organizations during the reporting period. Organizations that purchase different types of products/services should consider reporting separately against each different type of product/service. Organizations may wish to report this metric in conjunction with Supplier Organizations: Total (PI9566).
defined by: giin

Gross Earned Premium
type: Concept
type: Code
has name: Gross Earned Premium
has description: Value of premium earned by the organization as of the end of the reporting period, without any deductions for commissions or other expenses.
definition: Value of premium earned by the organization as of the end of the reporting period, without any deductions for commissions or other expenses.
has identifier: PI2025
notation: PI2025
had primary source: PI2025
note: Organizations should footnote all assumptions used.
scope note: This metric is intended to capture gross premium earned, calculated as the premium income (written) in the period minus the change in unearned premium reserve.
defined by: giin

Average Supplier Agriculture Yield: Total
type: Concept
type: Code
has name: Average Supplier Agriculture Yield: Total
has description: Average agricultural yield per hectare of supplier individuals who sold to the reporting organization during the reporting period.
definition: Average agricultural yield per hectare of supplier individuals who sold to the reporting organization during the reporting period.
has identifier: PI2046
notation: PI2046
had primary source: PI2046
note: Organizations should footnote all assumptions used, including source of data, details on the group, and unit of measure reporting against (such as kilograms or bushels per hectare) using Unit of Measure (PD1602). See usage guidance for further information.
scope note: NOTE: This metric will be deprecated in a forthcoming update to the IRIS Catalog of Metrics. Users are advised to instead report Average Agricultural Yield (PI5935), applied to Supplier Individuals: Total (PI5350). This metric is intended to capture the average output per hectare for farmers among an organization's suppliers. Organizations should not calculate this metric using aggregate data across all suppliers. Rather, as noted in the calculation, organizations should use farmer-specific data. Organizations should report yield from the most the recent harvest and footnote details on the unit of measure. This metric could be valuable for organizations that procure from farmers and provide support to improve their yields, such as training and technical assistance. Organizations interested in reporting the yields of client farmers should report Average Client Agricultural Yield: Total (PI3468). In some contexts, this metric can serve as an indicator of whether the outcome being sought by an investor or organization is occurring (the WHAT dimension of impact). For more on the alignment of IRIS metrics to the five dimensions of impact, see IRIS+ and the Five Dimensions of Impact (https://iris.thegiin.org/document/iris-and-the-five-dimensions/). No single metric is sufficient to understand an impact; rather, metrics are selected as a set across all dimensions of impact. When possible, the selection of metrics to measure and describe the five dimensions should be based on best practice and evidence.
defined by: giin

Promptness of Claims Submission
type: Concept
type: Code
has name: Promptness of Claims Submission
has description: Average number of days elapsed between the occurrence of an insured incident and the submission of a complete claim by the stakeholder (client of the organization) for all claims settled during the reporting period.
definition: Average number of days elapsed between the occurrence of an insured incident and the submission of a complete claim by the stakeholder (client of the organization) for all claims settled during the reporting period.
has identifier: PI2070
notation: PI2070
had primary source: PI2070
note: Organizations should footnote all assumptions used.
scope note: This metric is intended to capture how long on average (in days) it takes stakeholders to submit complete claims. Organizations should calculate this metric using the average days’ duration between an insured incident and the stakeholder’s submission of the complete claim. Organizations can use the raw data relevant to this metric when calculating Promptness of Claims Settlement (PI9897). For more detail on Promptness of Claims Settlement and for guidance on interpretation, see the Microinsurance Network’s Social Performance Indicators for Microinsurance, p. 19 (https://www.social-protection.org/gimi/ShowRessource.action?id=5270).
defined by: giin

Hazardous Waste Avoided
type: Concept
type: Code
has name: Hazardous Waste Avoided
has description: Amount of hazardous waste avoided through refurbishing, reusing, and recycling as part of delivering or developing the organization's products and services during the reporting period.
definition: Amount of hazardous waste avoided through refurbishing, reusing, and recycling as part of delivering or developing the organization's products and services during the reporting period.
has identifier: PI2073
notation: PI2073
had primary source: PI2073
note: Organizations should footnote all assumptions used.
scope note: This metric is intended to capture hazardous waste avoided as a result of substituting recycled materials in the organization's products and services. Organizations should report the total amount of hazardous waste avoided for all products and services delivered or developed during the reporting period. Hazardous waste is defined as refuse that could present dangers by contaminating and polluting the environment. It requires special disposal techniques to make it harmless or less dangerous. Specific classification of hazardous waste, which organizations should footnote, is typically defined by local legislation. Organizations that offer recycling services should report hazardous waste avoided as a result of the organization's delivery of hazardous waste recycling services. In some contexts, this metric can serve as an indicator of whether the outcome being sought by an investor or organization is occurring (the WHAT dimension of impact). For more on the alignment of IRIS metrics to the five dimensions of impact, see IRIS+ and the Five Dimensions of Impact (https://iris.thegiin.org/document/iris-and-the-five-dimensions/). No single metric is sufficient to understand an impact; rather, metrics are selected as a set across all dimensions of impact. When possible, the selection of metrics to measure and describe the five dimensions should be based on best practice and evidence.
defined by: giin

Target Stakeholder Spending: Connectivity
type: Concept
type: Code
has name: Target Stakeholder Spending: Connectivity
has description: Amount of money spent by an average target stakeholder on connectivity costs during the reporting period.
definition: Amount of money spent by an average target stakeholder on connectivity costs during the reporting period.
has identifier: PI2111
notation: PI2111
had primary source: PI2111
note: Organizations should footnote the type of expenditures made, as well as source of data and all assumptions used.
scope note: This metric is intended to capture target stakeholder spending to connect any digital device that allows individuals to call or message their social networks and/or access the Internet. Examples of such devices include smartphones, tablets, laptops, desktops, and personal digital assistants (PDAs). If these data are collected from target stakeholders through a survey, organizations should footnote details on the sample size and survey instrument used, as well as details on who administered the survey and who aggregated the resulting data. In some contexts, this metric can serve as an indicator of whether the outcome being sought by an investor or organization is occurring (the WHAT dimension of impact). For more on the alignment of IRIS metrics to the five dimensions of impact, see IRIS+ and the Five Dimensions of Impact (https://iris.thegiin.org/document/iris-and-the-five-dimensions/). No single metric is sufficient to understand an impact; rather, metrics are selected as a set across all dimensions of impact. When possible, the selection of metrics to measure and describe the five dimensions should be based on best practice and evidence.
defined by: giin

Vehicle Distance Traveled
type: Concept
type: Code
has name: Vehicle Distance Traveled
has description: Distance traveled by vehicles owned, operated, or sold by the organization during the reporting period.
definition: Distance traveled by vehicles owned, operated, or sold by the organization during the reporting period.
has identifier: PI2112
notation: PI2112
had primary source: PI2112
note: Organizations should footnote all assumptions used, including source of data.
scope note: This metric is intended to capture the total movement of vehicles using inland, road, or rail transport on a given network during the reporting period. This metric aligns with Vehicle Kilometers Traveled (VKT); data are most commonly expressed in kilometers. This metric can be used to calculate emissions intensity in the transport sector, dividing Greenhouse Gas Emissions: Total (OI1479).
defined by: giin

Distributor Individuals: Low Income
type: Concept
type: Code
has name: Distributor Individuals: Low Income
has description: Number of low-income individuals who served as distributors of the organization's products/services during the reporting period.
definition: Number of low-income individuals who served as distributors of the organization's products/services during the reporting period.
has identifier: PI2125
notation: PI2125
had primary source: PI2125
note: Organizations should footnote all assumptions used, including the assessment tools used to identify low-income distributors. See usage guidance for further information.
scope note: This metric is intended to capture how many self-employed, low-income individuals sold the organization's products or services during the reporting period, either to other distributors (wholesale) or to ultimate consumers (retail). Distributors counted under this metric need not exclusively sell the organization's products or services. Direct employees who distribute the organization's goods or services should be considered employees, not distributors. The population classified as low income includes all those who fall below a fixed threshold, which includes those classified as poor or very poor. Because assessing the poverty level of distributors is complex, organizations will likely use specific assessment tools to accurately report on this metric. See the glossary definition for additional information on commonly used tools to help determine the absolute poverty level of individuals and households. This metric is multi-dimensional with regard to the five dimensions of impact: it may help describe the WHO dimension when the stakeholder group represented by the metric is the stakeholder group targeted by the investment or organization. It may also help measure the HOW MUCH Scale dimension, which helps estimate the number of the targeted stakeholders experiencing the outcome. For more on the alignment of IRIS metrics to the five dimensions of impact, see IRIS+ and the Five Dimensions of Impact (https://iris.thegiin.org/document/iris-and-the-five-dimensions/). No single metric is sufficient to understand an impact; rather, metrics are selected as a set across all dimensions of impact. When possible, the selection of metrics to measure and describe the five dimensions should be based on best practice and evidence.
defined by: giin

Length of Adjacent Protected Land
type: Concept
type: Code
has name: Length of Adjacent Protected Land
has description: Length of protected land boundary shared with the organization's protected land as of the end of the reporting period.
definition: Length of protected land boundary shared with the organization's protected land as of the end of the reporting period.
has identifier: PI2135
notation: PI2135
had primary source: PI2135
note: Organizations should footnote all assumptions used. See usage guidance for further information.
scope note: This metric is intended to capture the length of the boundary of the organization's protected land that is immediately adjacent to already-protected land parcels, thus compounding the total amount of protected land. For many conservation objectives, large, connected areas of conserved land are more valuable than small, disconnected pieces of conserved land. This metric helps capture holistically how a specific project complements previous conservation work.
defined by: giin

School Enrollment: Low Income
type: Concept
type: Code
has name: School Enrollment: Low Income
has description: Number of low-income students enrolled as of the end of the reporting period, both full- and part-time, with each discrete student counted once regardless of their number of courses.
definition: Number of low-income students enrolled as of the end of the reporting period, both full- and part-time, with each discrete student counted once regardless of their number of courses.
has identifier: PI2173
notation: PI2173
had primary source: PI2173
note: Organizations should footnote all assumptions used, including details on the assessment tools used to identify low-income students. Organizations should also break down enrolled low-income students into full- and part-time. See usage guidance for further information.
scope note: This metric is intended to capture the number of students from low-income backgrounds who are enrolled at the school as of the end of the reporting period. This metric includes both full- and part-time students. Each discrete student is counted once, regardless of the number of courses taken. These data may be most effectively collected through either school reporting (for private schools) or government reporting (for public schools). The population classified as low income includes all those who fall below a fixed threshold, which includes those classified as poor or very poor. Because assessing the poverty level of stakeholders is complex, organizations will likely use specific assessment tools to accurately report on this metric. See the glossary definition for additional information on commonly used tools to help determine the absolute poverty level of individuals and households. This metric is multi-dimensional with regard to the five dimensions of impact. It may help describe the WHO dimension when the stakeholder group represented by the metric is the stakeholder group targeted by the investment or organization. It may also help measure the HOW MUCH Scale dimension, which helps estimate the number of the targeted stakeholders experiencing the outcome. For more on the alignment of IRIS metrics to the five dimensions of impact, see IRIS+ and the Five Dimensions of Impact (https://iris.thegiin.org/document/iris-and-the-five-dimensions/). No single metric is sufficient to understand an impact; rather, metrics are selected as a set across all dimensions of impact. When possible, the selection of metrics to measure and describe the five dimensions should be based on best practice and evidence.
defined by: giin

Client Households: No Direct Payment
type: Concept
type: Code
has name: Client Households: No Direct Payment
has description: Number of unique client households that received products/services during the reporting period where no direct payment was provided to the organization at the time of service but for which the organization expects to be reimbursed.
definition: Number of unique client households that received products/services during the reporting period where no direct payment was provided to the organization at the time of service but for which the organization expects to be reimbursed.
has identifier: PI2180
notation: PI2180
had primary source: PI2180
note: Organizations should footnote all assumptions used, including source of data. See usage guidance for further information.
scope note: This metric is intended to capture the number of unique client households that received products or services where no out-of-pocket payment was provided and for which the organization expects to be reimbursed by third parties (such as insurance). Organizations should include the unique number of client households that received products/services and made no direct payment, regardless of whether or not these same households may also have paid the organization directly for certain products or services during the reporting period. Many organizations may not be able to report on the number of client households using direct data. For example, organizations that sell water purification systems through a series of local network distributors might estimate the number of client households reached based on the number of units sold. Organizations should footnote details on how and why these assumptions were made.
defined by: giin

Client Individuals: Referred
type: Concept
type: Code
has name: Client Individuals: Referred
has description: Number of unique individual clients of the organization who were referred by other clients of the organization during the reporting period.
definition: Number of unique individual clients of the organization who were referred by other clients of the organization during the reporting period.
has identifier: PI2185
notation: PI2185
had primary source: PI2185
note: Organizations should footnote all assumptions used, including source of data. See usage guidance for further information.
scope note: This metric is intended to capture the number of unique clients who received the organization’s products or services during the reporting period and who were referred to the organization by other clients of the organization. It is not a measure of foot traffic, nor is it intended to capture the number of consumer transactions. For example, a customer who makes two purchases during a period should be counted only once. Organizations wishing to report on total client transactions should refer to Client Transactions (PI5184). This metric is intended to capture the unique number of specific individuals served. Organizations should not use any household multipliers when reporting against this metric. If organizations consider entire households to be the customer/client, they can report against Client Households: Total (PI7954) and its associated submetrics. Many organizations may not be able to report on the number of clients using direct data. For example, organizations that sell solar lanterns through a series of local network distributors might estimate the number of client individuals reached based on the number of units sold. Organizations should footnote details on how and why these assumptions were made. For healthcare providers, “client individuals” refers to patients. For housing providers, “client individuals” refers to residents or tenants.
defined by: giin

Number of Complaints Registered
type: Concept
type: Code
has name: Number of Complaints Registered
has description: Number of complaints registered by clients of the organization during the reporting period.
definition: Number of complaints registered by clients of the organization during the reporting period.
has identifier: PI2197
notation: PI2197
had primary source: PI2197
note: Organizations should footnote all assumptions used.
scope note: This metric is intended to capture the number of unique complaints made by clients of the organization. The metric assumes that the provider has a complaint tracking system as part of its system for redress. Organizations are encouraged to report this metric in conjunction with Complaints Ratio (PI5216) and Client Complaint Tracking System (PI9435).
defined by: giin

Energy Generated for Sale: Non-Renewable
type: Concept
type: Code
has name: Energy Generated for Sale: Non-Renewable
has description: Amount of non-renewable energy generated and sold to offtaker(s) during the reporting period.
definition: Amount of non-renewable energy generated and sold to offtaker(s) during the reporting period.
has identifier: PI2210
notation: PI2210
had primary source: PI2210
note: Organizations should footnote the non-renewable energy type(s) and all assumptions used.
scope note: NOTE: This metric will be deprecated in a forthcoming update to the IRIS Catalog of Metrics. Users are advised to instead report Energy Generated for Sale: Total (PI8706), disaggregated by Primary Energy Source (OI3781), all options under Non-Renewable. This metric is intended to capture non-renewable energy generated for commercial sale by the organization. Bulk energy is usually sold under a power purchase agreement with an electricity utility. The buyer or purchaser of this energy is termed the offtaker. Non-renewable energy sources include coal, natural gas, and crude oil derivatives, among other forms. Organizations may refer to the glossary for additional information. Organizations wishing to report on the amount of non-renewable energy generated for their own use should report Energy Generated for Use: Non-Renewable (OI1495). In some contexts, this metric can serve as an indicator of whether the outcome being sought by an investor or organization is occurring (the WHAT dimension of impact). For more on the alignment of IRIS metrics to the five dimensions of impact, see IRIS+ and the Five Dimensions of Impact (https://iris.thegiin.org/document/iris-and-the-five-dimensions/). No single metric is sufficient to understand an impact; rather, metrics are selected as a set across all dimensions of impact. When possible, the selection of metrics to measure and describe the five dimensions should be based on best practice and evidence.
defined by: giin

Service Hours Interrupted
type: Concept
type: Code
has name: Service Hours Interrupted
has description: Number of hours-of-service interruptions during the reporting period.
definition: Number of hours-of-service interruptions during the reporting period.
has identifier: PI2230
notation: PI2230
had primary source: PI2230
note: Organizations should footnote all assumptions used.
scope note: This metric is intended to capture the amount of time a service—for example, hours of electricity, running water, or internet service—is interrupted or unavailable to clients. Organizations may use Product/Service Detailed Type (PD1516) to describe or disaggregate this metric by services provided. By comparing this metric to the total duration of the reporting period, organizations can estimate the quality of services provided. Organizations are encouraged to use this metric in combination with Service Hours Provided (PI5683) to capture service outage rates. Organizations may choose to use Service Interruptions (PI3720) to capture the number of interruptions rather than the total hours of interruption. This metric is often used by International Finance Institutions (IFIs) as part of infrastructure analysis. This metric may help describe the HOW MUCH Scale dimension, which helps estimate the number of the targeted stakeholders experiencing the outcome. For more on the alignment of IRIS metrics to the five dimensions of impact, see IRIS+ and the Five Dimensions of Impact (https://iris.thegiin.org/document/iris-and-the-five-dimensions/). No single metric is sufficient to understand an impact; rather, metrics are selected as a set across all dimensions of impact. The selection of metrics to measure and describe the five dimensions should be based on best practice and evidence.
defined by: giin

Supplier Individuals: Poor
type: Concept
type: Code
has name: Supplier Individuals: Poor
has description: Number of poor individuals who sold goods or services to the organization during the reporting period.
definition: Number of poor individuals who sold goods or services to the organization during the reporting period.
has identifier: PI2242
notation: PI2242
had primary source: PI2242
note: Organizations should footnote all assumptions used, including the assessment tools used to identify the poverty level of suppliers. See usage guidance for further information.
scope note: This metric is intended to capture how organizations support individuals living in poverty through their supply chains. Because assessing the poverty level of stakeholders is complex, organizations will likely have to use specific assessment tools to accurately report on this metric. See the glossary definition for additional information on commonly used tools to help determine the absolute poverty level of individuals and households. This metric is multi-dimensional with regard to the five dimensions of impact: it may help describe the WHO dimension when the stakeholder group represented by the metric is the stakeholder group targeted by the investment or organization. It may also help measure the HOW MUCH Scale dimension, which helps estimate the number of the targeted stakeholders experiencing the outcome. For more on the alignment of IRIS metrics to the five dimensions of impact, see IRIS+ and the Five Dimensions of Impact (https://iris.thegiin.org/document/iris-and-the-five-dimensions/). No single metric is sufficient to understand an impact; rather, metrics are selected as a set across all dimensions of impact. When possible, the selection of metrics to measure and describe the five dimensions should be based on best practice and evidence.
defined by: giin

Schooling Status
type: Concept
type: Code
has name: Schooling Status
has identifier: PI2250
notation: PI2250
had primary source: PI2250
note: Organizations should footnote all assumptions used, including source(s) of data.
scope note: This metric is intended to capture the enrollment, progress, and transitions of students served by the organization during the reporting period. Used alone, it describes the schooling status of students in projects supported by the organization. Alternatively, or in addition, it may be used to disaggregate other metrics, such as Client Individuals: Total (PI4060), to capture the number of students with each status. This metric helps organizations capture pupil-flow rates. For more on this concept, see UNESCO's Learning Portal (https://learningportal.iiep.unesco.org/en/glossary/pupil-flow-rates). This metric may help describe the HOW MUCH Scale dimension, which helps estimate the number of the targeted stakeholders experiencing the outcome. For more on the alignment of IRIS metrics to the five dimensions of impact, see IRIS+ and the Five Dimensions of Impact (https://iris.thegiin.org/document/iris-and-the-five-dimensions/). No single metric is sufficient to understand an impact; rather, metrics are selected as a set across all dimensions of impact. When possible, the selection of metrics to measure and describe the five dimensions should be based on best practice and evidence.
has description: Describes the schooling status of students served by the organization during the reporting period. Choose all that apply: Enrollment status: - Enrolled - Not enrolled - Other (describe) Grade promotion: - Promoted to next year of schooling - Repeated year of schooling - Dropped out - Graduated - Other (describe)
definition: Describes the schooling status of students served by the organization during the reporting period. Choose all that apply: Enrollment status: - Enrolled - Not enrolled - Other (describe) Grade promotion: - Promoted to next year of schooling - Repeated year of schooling - Dropped out - Graduated - Other (describe)
defined by: giin

Jobs Created at Directly Supported/Financed Enterprises: Low-Income Areas
type: Concept
type: Code
has name: Jobs Created at Directly Supported/Financed Enterprises: Low-Income Areas
has identifier: PI2251
notation: PI2251
had primary source: PI2251
note: Organizations should footnote all assumptions used, including how they identify low-income areas. Organizations that report data for more than one reporting period should be careful to very clearly footnote which they are using for this metric. See usage guidance for further information.
scope note: This metric is intended to capture jobs created at supported organizations and in low-income areas during the reporting period. Organizations may choose to disclose employment by function (for example, operations and maintenance, construction, or land conservation). To align to the HIPSO (Harmonized Indicators for Private Sector Operations) indicator Direct Jobs Created by the Investment (Operations and Maintenance), organizations should include under Jobs Type (OD0660) only the options, “Hiring: Jobs hired through organization itself” and “Hiring: Jobs hired/supported through a third-party and directly related to the organization’s operations and maintenance of company.” The three metrics for jobs at supported/financed enterprises relate to one another, as follows. Jobs Maintained at Directly Supported/Financed Enterprises: Total (PI5691) and Jobs Created at Directly Supported/Financed Enterprises: Total (PI3687) sum to Jobs in Directly Supported/Financed Enterprises (PI4874). For example, if an investor provided a loan to a small business that had 10 employees at the time the loan was provided and 15 employees as of the end of the reporting period, Jobs Created at Directly Supported/Financed Enterprises: Total (PI3687) would be 5; Jobs in Directly Supported/Financed Enterprises (PI4874) would be 15; and Jobs Maintained at Directly Supported/Financed Enterprises: Total (PI5691) would be 10. Organizations can refer to the glossary for additional information on defining low-income areas. Direct jobs in the context of this metric are defined according to the scope of the project (for instance, jobs created at a company that receives investment), following project logic and objectives. For some types of financial intermediaries, organizations should footnote a clear definition of direct jobs. For instance, if measured using a capacity-building approach, direct jobs supported are identified at the direct, operational level. If defined using an economic impact approach, …
has description: Net number of new, full-time equivalent employees living in low-income areas and working for enterprises directly financed or supported by the organization during the reporting period. Many organizations select the beginning of the reporting period as the time when the organization began its support or investment.
definition: Net number of new, full-time equivalent employees living in low-income areas and working for enterprises directly financed or supported by the organization during the reporting period. Many organizations select the beginning of the reporting period as the time when the organization began its support or investment.
defined by: giin

Payments to Supplier Individuals: Female
type: Concept
type: Code
has name: Payments to Supplier Individuals: Female
has description: Value of payments made by the organization to female individuals who sold goods or services to the organization during the reporting period.
definition: Value of payments made by the organization to female individuals who sold goods or services to the organization during the reporting period.
has identifier: PI2302
notation: PI2302
had primary source: PI2302
note: Organizations should footnote all assumptions used.
scope note: This metric is intended to capture how organizations support the livelihoods of female individuals through their supply chains.
defined by: giin

School Enrollment: Total
type: Concept
type: Code
has name: School Enrollment: Total
has description: Number of students enrolled as of the end of the reporting period, both full- and part-time, with each discrete student counted once regardless of their number of courses.
definition: Number of students enrolled as of the end of the reporting period, both full- and part-time, with each discrete student counted once regardless of their number of courses.
has identifier: PI2389
notation: PI2389
had primary source: PI2389
note: Organizations should footnote all assumptions used, as well as a breakdown of full- and part-time students.
scope note: This metric is intended to capture the number of students enrolled at the school as of the end of the reporting period, including both full- and part-time students. Each discrete student is counted once, regardless of the number of courses taken. These data may be most effectively collected through either school reporting (for private schools) or through reporting (for public schools). This metric is multi-dimensional with regard to the five dimensions of impact. It may help describe the WHO dimension when the stakeholder group represented by the metric is the stakeholder group targeted by the investment or organization. It may also help measure the HOW MUCH Scale dimension, which helps estimate the number of the targeted stakeholders experiencing the outcome. For more on the alignment of IRIS metrics to the five dimensions of impact, see IRIS+ and the Five Dimensions of Impact (https://iris.thegiin.org/document/iris-and-the-five-dimensions/). No single metric is sufficient to understand an impact; rather, metrics are selected as a set across all dimensions of impact. When possible, the selection of metrics to measure and describe the five dimensions should be based on best practice and evidence.
defined by: giin

Value of Community Facilities Financed
type: Concept
type: Code
has name: Value of Community Facilities Financed
has description: Value of community facilities projected to be built, renovated, or purchased as a result of investments made by the organization during the reporting period.
definition: Value of community facilities projected to be built, renovated, or purchased as a result of investments made by the organization during the reporting period.
has identifier: PI2410
notation: PI2410
had primary source: PI2410
note: Organizations should footnote all assumptions used.
scope note: This metric is intended to capture the value of investments made by the organization during the reporting period to construct, renovate, or purchase new community facilities. It should not include the value of the actual housing units themselves. A community facility provides services to the local community. Examples include health and medical clinics, health-treatment facilities, schools, arts and other cultural facilities, daycare facilities (adult and youth), and community sports facilities.
defined by: giin

Units/Volume Purchased at Price Premium
type: Concept
type: Code
has name: Units/Volume Purchased at Price Premium
has description: Units/volume from individuals and organizations that sold to the organization and that have received a price premium during the reporting period.
definition: Units/volume from individuals and organizations that sold to the organization and that have received a price premium during the reporting period.
has identifier: PI2422
notation: PI2422
had primary source: PI2422
note: Organizations should footnote all assumptions used, including source of data.
scope note: This metric is intended to capture the quantity of goods purchased by the reporting organization at a price premium. When possible, organizations are encouraged to report this metric in conjunction with Producer Price Premium (PI1568), which measures the percentage premium suppliers receive by selling to the organization.
defined by: giin

Communities Served
type: Concept
type: Code
has name: Communities Served
has description: Number of communities where the organization's products and services were available during the reporting period.
definition: Number of communities where the organization's products and services were available during the reporting period.
has identifier: PI2476
notation: PI2476
had primary source: PI2476
note: Organizations should footnote their definition of community and all assumptions used, including source of data. See usage guidance for further information.
scope note: This metric is intended to capture the number of communities the organization serves, determined through various methods. For example, some organizations can use the number of open branches as an accurate proxy for the number of communities served.
defined by: giin

Number of Housing Units Constructed
type: Concept
type: Code
has name: Number of Housing Units Constructed
has description: Number of housing units constructed by the organization during the reporting period.
definition: Number of housing units constructed by the organization during the reporting period.
has identifier: PI2491
notation: PI2491
had primary source: PI2491
note: Organizations should footnote all assumptions used. See usage guidance for further information.
scope note: This metric is intended to capture the gross number of housing units constructed in both single- and multi-family buildings. Organizations are also encouraged to footnote the net number of housing units constructed (by subtracting from the gross number any housing units lost during the previous reporting period), additionally footnoting relevant details. Organizations should only report housing units the construction of which has already been completed, not those financed and still under construction.
defined by: giin

Length of Coastline Restored
type: Concept
type: Code
has name: Length of Coastline Restored
has description: Length of marine or freshwater coastline under management for ecological restoration on protected land, land under sustainable stewardship, or land under sustainable cultivation during the reporting period.
definition: Length of marine or freshwater coastline under management for ecological restoration on protected land, land under sustainable stewardship, or land under sustainable cultivation during the reporting period.
has identifier: PI2538
notation: PI2538
had primary source: PI2538
note: Organizations should footnote all assumptions used, as well as relevant ecological restoration activities undertaken during the reporting period.
scope note: This metric is intended to capture the entire length of coastline the organization is working to restore during the reporting period, not just any additional length of coastline that began restoration during the reporting period. Climate change raises sea levels and intensifies storms, and coast erosion and land loss are a consequence. Restoring reefs, mangroves, and other stabilizing and wave-mitigating infrastructure can help create climate-resilient coasts. Protecting aquatic ecosystems near coastlines also counters the biodiversity decline threatened by the degrading effects of land use changes, pollutants, and invasive species. Organizations can refer to the glossary for additional information on ecological restoration.
defined by: giin

Earnings of Distributor Individuals: Female
type: Concept
type: Code
has name: Earnings of Distributor Individuals: Female
has description: Earnings of female individual distributors as a result of selling the organization’s products/services during the reporting period.
definition: Earnings of female individual distributors as a result of selling the organization’s products/services during the reporting period.
has identifier: PI2551
notation: PI2551
had primary source: PI2551
note: Organizations should footnote all assumptions used.
scope note: This metric is intended to capture the total gross margin earned by, or commission paid to, individual female distributors, a measure of how organizations support the livelihoods of women through their distribution chains.
defined by: giin

Supplier Individuals: Rural
type: Concept
type: Code
has name: Supplier Individuals: Rural
has description: Number of individuals residing in rural areas who sold goods or services to the organization during the reporting period.
definition: Number of individuals residing in rural areas who sold goods or services to the organization during the reporting period.
has identifier: PI2566
notation: PI2566
had primary source: PI2566
note: Organizations should footnote all assumptions used.
scope note: This metric is intended to capture how organizations support the livelihoods of individuals residing in rural areas through their supply chains. This metric is multi-dimensional with regard to the five dimensions of impact: it may help describe the WHO dimension when the stakeholder group represented by the metric is the stakeholder group targeted by the investment or organization. It may also help measure the HOW MUCH Scale dimension, which helps estimate the number of the targeted stakeholders experiencing the outcome. For more on the alignment of IRIS metrics to the five dimensions of impact, see IRIS+ and the Five Dimensions of Impact (https://iris.thegiin.org/document/iris-and-the-five-dimensions/). No single metric is sufficient to understand an impact; rather, metrics are selected as a set across all dimensions of impact. When possible, the selection of metrics to measure and describe the five dimensions should be based on best practice and evidence.
defined by: giin

Client Organizations: Provided New Access
type: Concept
type: Code
has name: Client Organizations: Provided New Access
has identifier: PI2575
notation: PI2575
had primary source: PI2575
note: Organizations should footnote all assumptions used, including source of data. Organizations should also footnote the types of enterprises that were clients, using Client Type (PD7993).
scope note: This metric is intended to capture the number of unique client organizations (enterprises) of the reporting organization that gained new access to products and services during the reporting period that they could not otherwise access prior to the reporting period. Organizations are encouraged to footnote details of how they expanded access to products and services. This metric is multi-dimensional with regard to the five dimensions of impact. It may help describe the WHO dimension when the stakeholder group represented by the metric is the stakeholder group targeted by the investment or organization. It may also help measure the HOW MUCH Scale dimension, which helps estimate the number of the targeted stakeholders experiencing the outcome. For more on the alignment of IRIS metrics to the five dimensions of impact, see IRIS+ and the Five Dimensions of Impact (https://iris.thegiin.org/document/iris-and-the-five-dimensions/). No single metric is sufficient to understand an impact; rather, metrics are selected as a set across all dimensions of impact. When possible, the selection of metrics to measure and describe the five dimensions should be based on best practice and evidence.
has description: Number of enterprise clients that were served by the organization and provided access, during the reporting period, to products/services they were unable to access prior to the reporting period. For further clarification, organizations should reference New Access to Water, New Access to Energy, New Access to Education, New Access to Finance, or New Access to Healthcare in the glossary.
definition: Number of enterprise clients that were served by the organization and provided access, during the reporting period, to products/services they were unable to access prior to the reporting period. For further clarification, organizations should reference New Access to Water, New Access to Energy, New Access to Education, New Access to Finance, or New Access to Healthcare in the glossary.
defined by: giin

Earnings of Distributor Individuals: Low Income
type: Concept
type: Code
has name: Earnings of Distributor Individuals: Low Income
has description: Earnings of low-income individual distributors as a result of selling the organization’s products/services during the reporting period.
definition: Earnings of low-income individual distributors as a result of selling the organization’s products/services during the reporting period.
has identifier: PI2594
notation: PI2594
had primary source: PI2594
note: Organizations should footnote all assumptions used, including details on the assessment tools used to identify low-income distributors. See usage guidance for further information.
scope note: This metric is intended to capture the total gross margin earned by, or commission paid to, individual low-income distributors, a measure of how organizations support the livelihoods of low-income individuals through their distribution chains. The population classified as low income includes all those who fall below a fixed threshold, which includes those classified as poor or very poor. Because assessing the poverty level of distributors is complex, organizations will likely use specific assessment tools to accurately report on this metric. See the glossary definition for additional information on commonly used tools to help determine the absolute poverty level of individuals and households.
defined by: giin

Individuals Housed
type: Concept
type: Code
has name: Individuals Housed
has description: Number of individuals projected to be housed in single- or multi-family dwellings as a result of new construction, loans, repairs, or remodeling resulting from investments made by the organization during the reporting period.
definition: Number of individuals projected to be housed in single- or multi-family dwellings as a result of new construction, loans, repairs, or remodeling resulting from investments made by the organization during the reporting period.
has identifier: PI2640
notation: PI2640
had primary source: PI2640
note: Organizations should footnote all assumptions used.
scope note: This metric is intended to capture a projection of individuals housed based on assumptions, which should be footnoted; organizations that can collect direct counts of tenants or residents should instead use Client Individuals: Total (PI4060). Organizations are encouraged to estimate the number of target stakeholders in their annual or impact reports. For example, the City of New York included the numbers of potential buyers or users of affordable housing in their "Five-Borough, Ten-Year Plan." This metric is multi-dimensional with regard to the five dimensions of impact: it may help describe the WHO dimension when the stakeholder group represented by the metric is the stakeholder group targeted by the investment or organization. It may also help measure the HOW MUCH Scale dimension, which helps estimate the number of the targeted stakeholders experiencing the outcome. For more on the alignment of IRIS metrics to the five dimensions of impact, see IRIS+ and the Five Dimensions of Impact (https://iris.thegiin.org/document/iris-and-the-five-dimensions/). No single metric is sufficient to understand an impact; rather, metrics are selected as a set across all dimensions of impact. When possible, the selection of metrics to measure and describe the five dimensions should be based on best practice and evidence.
defined by: giin

Jobs Maintained at Directly Supported/Financed Enterprises: Low-Income Areas
type: Concept
type: Code
has name: Jobs Maintained at Directly Supported/Financed Enterprises: Low-Income Areas
has identifier: PI2688
notation: PI2688
had primary source: PI2688
note: Organizations should footnote all assumptions used, including how they identify low-income areas. Organizations that report data for more than one reporting period should be careful to very clearly footnote which they are using for this metric. See usage guidance for further information.
scope note: This metric is intended to capture jobs in low-income areas maintained during the reporting period at directly supported or financed enterprises. Organizations may choose to disclose employment by function (for example, operations and maintenance, construction, or land conservation). Organizations should measure the number of maintained full-time equivalent positions at the organization, regardless of the number of unique individuals employed or the positions they held. For example, if a full-time equivalent employee resigns and the position is filled, this position should count as just one full-time equivalent job maintained, and none created. The three metrics for jobs at supported/financed enterprises relate to one another, as follows. Jobs Maintained at Directly Supported/Financed Enterprises: Total (PI5691) and Jobs Created at Directly Supported/Financed Enterprises: Total (PI3687) sum to Jobs in Directly Supported/Financed Enterprises (PI4874). For example, if an investor provided a loan to a small business that had 10 employees at the time the loan was provided and 15 employees as of the end of the reporting period, Jobs Created at Directly Supported/Financed Enterprises: Total (PI3687) would be 5; Jobs in Directly Supported/Financed Enterprises (PI4874) would be 15; and Jobs Maintained at Directly Supported/Financed Enterprises: Total (PI5691) would be 10. Organizations can refer to the glossary for additional information on defining low-income areas. While this metric requests data on full-time equivalents (FTE), organizations are encouraged to break down these data for full- and part-time positions supported/financed. Most companies break down their headcount into full- and part-time positions, which investors often translate into FTE. For translation from headcount to FTE, organizations should refer to the following guidance, as well as the IRIS glossary term on full-time equivalent. In brief, in calculating the number of full-time equivalent jobs, part-t…
has description: Number of full-time equivalent employees who reside in low-income areas and work for enterprises directly financed or supported by the organization at the beginning of the reporting period and who remain at the organization as of the end of the reporting period. Many organizations select the beginning of the reporting period as the time when the organization began its support or investment.
definition: Number of full-time equivalent employees who reside in low-income areas and work for enterprises directly financed or supported by the organization at the beginning of the reporting period and who remain at the organization as of the end of the reporting period. Many organizations select the beginning of the reporting period as the time when the organization began its support or investment.
defined by: giin

School Fees
type: Concept
type: Code
has name: School Fees
has description: Average school fees per student per month during the reporting period.
definition: Average school fees per student per month during the reporting period.
has identifier: PI2718
notation: PI2718
had primary source: PI2718
note: Organizations should footnote all assumptions used.
scope note: This metric is intended to capture the affordability of education, which is a component of access.
defined by: giin

Distributor Individuals: Total
type: Concept
type: Code
has name: Distributor Individuals: Total
has description: Number of individuals who served as distributors of the organization’s products/services during the reporting period.
definition: Number of individuals who served as distributors of the organization’s products/services during the reporting period.
has identifier: PI2758
notation: PI2758
had primary source: PI2758
note: Organizations should footnote all assumptions used.
scope note: This metric is intended to capture how many self-employed individuals sold the organization’s products or services, either to other distributors (wholesale) or to ultimate consumers (retail), during the reporting period. Organizations wishing to report on distributor organizations should instead use Distributor Organizations: Total (PI1060) and its related submetrics. Distributors need not exclusively sell the organization’s products or services. Direct employees who distribute the organization’s goods or services should be considered employees, not distributors. This metric is multi-dimensional with regard to the five dimensions of impact: it may help describe the WHO dimension when the stakeholder group represented by the metric is the stakeholder group targeted by the investment or organization. It may also help measure the HOW MUCH Scale dimension, which helps estimate the number of the targeted stakeholders experiencing the outcome. For more on the alignment of IRIS metrics to the five dimensions of impact, see IRIS+ and the Five Dimensions of Impact (https://iris.thegiin.org/document/iris-and-the-five-dimensions/). No single metric is sufficient to understand an impact; rather, metrics are selected as a set across all dimensions of impact. When possible, the selection of metrics to measure and describe the five dimensions should be based on best practice and evidence.
defined by: giin

Greenhouse Gas Emissions Avoided
type: Concept
type: Code
has name: Greenhouse Gas Emissions Avoided
has description: Amount of greenhouse gas (GHG) emissions avoided by the organization during the reporting period.
definition: Amount of greenhouse gas (GHG) emissions avoided by the organization during the reporting period.
has identifier: PI2764
notation: PI2764
had primary source: PI2764
note: Organizations should footnote all assumptions used, including detailed information on calculation methodology and source of data. See usage guidance for further information.
scope note: This metric is intended to capture the total amount of GHG emissions that were avoided by the organization during the reporting period. Organizations should use this metric in combination with Greenhouse Gas Emissions Mitigation Types (OI9839) in order to disaggregate the types of GHG emissions avoided that are relevant to the organization's activities. This metric refers to GHG emissions avoided during the reporting period. GHG emissions avoidance is typically attributed to product replacement; organizations can therefore use this metric in conjunction with Greenhouse Gas Emissions of Product (PD9427) and Greenhouse Gas Emissions of Product Replaced (PD2243). This metric is multi-dimensional with regard to the five dimensions of impact. In some contexts, this metric can serve as an indicator of whether the outcome being sought by an investor or organization is occurring (the WHAT dimension of impact). It may also help measure the HOW MUCH Scale dimension, which helps estimate the number of the targeted stakeholders experiencing the outcome. For more on the alignment of IRIS metrics to the five dimensions of impact, see IRIS+ and the Five Dimensions of Impact (https://iris.thegiin.org/document/iris-and-the-five-dimensions/). No single metric is sufficient to understand an impact; rather, metrics are selected as a set across all dimensions of impact. When possible, the selection of metrics to measure and describe the five dimensions should be based on best practice and evidence.
defined by: giin

Food Insecurity Experience
type: Concept
type: Code
has name: Food Insecurity Experience
has description: Score describing the experienced severity of food security among a set of stakeholders defined by another metric or set. See usage guidance for further detail and resources.
definition: Score describing the experienced severity of food security among a set of stakeholders defined by another metric or set. See usage guidance for further detail and resources.
has identifier: PI2771
notation: PI2771
had primary source: PI2771
note: Organizations should footnote all assumptions used.
scope note: This metric is intended to capture the adequacy of target stakeholders’ access to food by asking them directly about their experiences. Organizations should apply this metric to a metric or set of metrics that defines the relevant set of target stakeholders. For example, some organizations might report Client Households: Total (PI7954), disaggregated by relevant options from Target Stakeholder Demographics (PD5752). Other organizations with a different target stakeholder might instead apply this metric to Supplier Individuals: Total (PI5350). This indicator is based on and refers to the Food Insecurity Experience Scale (FIES) developed by FAO’s Voices of the Hungry Project. The FIES is an experience-based measure of food insecurity severity that relies on people’s direct responses to questions about their experiences facing constrained access to food. The FIES can be used to estimate the prevalence of food insecurity at different levels of severity, which is key information for implementing policies that aim to realize the human right to food. The FIES Survey Module (FIES-SM) comprises eight questions regarding people's access to adequate food and can be easily integrated into various types of surveys. For more on FIES, including the questions translated into over 170 languages, link to SDG 2.1.2, and free data analysis tools, see FAO’s FIES website (https://www.fao.org/in-action/voices-of-the-hungry/background/en/). Additional information can be found at INDDEX (https://inddex.nutrition.tufts.edu/data4diets/indicator/food-insecurity-experience-scale-fies).
defined by: giin

Greenhouse Gas Emissions Avoided Due to Carbon Offsets Sold
type: Concept
type: Code
has name: Greenhouse Gas Emissions Avoided Due to Carbon Offsets Sold
has description: Amount of greenhouse gas (GHG) emissions avoided through carbon credits sold during the reporting period.
definition: Amount of greenhouse gas (GHG) emissions avoided through carbon credits sold during the reporting period.
has identifier: PI2787
notation: PI2787
had primary source: PI2787
note: Organizations should footnote relevant details on the carbon offsets sold, along with the assumptions and methodologies used in calculating the emissions avoided. See usage guidance for further information.
scope note: This metric is intended to capture the amount of greenhouse gas (GHG) emissions avoided through the organization’s sale of carbon credits during the reporting period. The same data captured through this metric can also be captured through a combination of Greenhouse Gas Emissions Mitigation Types (OI9839) and Greenhouse Gas Emissions Avoided or Reduced (PI2764). Examples of relevant details to footnote include the methodology used to quantify the GHG offsets, equivalent monetary value of the carbon credits generated and sold, information on the carbon offset market(s) in which the organization sold the credit(s), and the unique identification number and third-party registry for the carbon credit(s) sold. Organizations can refer to the glossary for additional information on carbon credits. A number of methodologies offer detailed procedures for quantifying the real GHG benefits of a project, along with guidance to help project developers determine project boundaries, set baselines, assess additionality, and ultimately quantify the GHG emissions that were reduced or removed. For more information and examples, see the Verified Carbon Standard (http://www.v-c-s.org/methodologies/what-methodology). In some contexts, this metric can serve as an indicator of whether the outcome being sought by an investor or organization is occurring (the WHAT dimension of impact). For more on the alignment of IRIS metrics to the five dimensions of impact, see IRIS+ and the Five Dimensions of Impact (https://iris.thegiin.org/document/iris-and-the-five-dimensions/). No single metric is sufficient to understand an impact; rather, metrics are selected as a set across all dimensions of impact. When possible, the selection of metrics to measure and describe the five dimensions should be based on best practice and evidence.
defined by: giin

Client Individuals: Provided New Access
type: Concept
type: Code
has name: Client Individuals: Provided New Access
has identifier: PI2822
notation: PI2822
had primary source: PI2822
note: Organizations should footnote all assumptions used, including source of data. See usage guidance for further information.
scope note: This metric is intended to capture the number of unique clients who received the organization’s products or services during the reporting period and who were unable to access these products and services from organizations in periods prior. See glossary for further guidance. This metric is not a measure of foot traffic, nor is it intended to capture the number of consumer transactions. For example, a customer who makes two purchases during a period should be counted only once. Organizations wishing to report on total client transactions should refer to Client Transactions (PI5184). This metric is intended to capture the unique number of specific individuals served. Organizations should not use any household multipliers when reporting against this metric. If organizations consider entire households to be the customer/client, they can report against Client Households: Total (PI7954) and its associated submetrics. Many organizations may not be able to report on the number of clients using direct data. For example, organizations that sell solar lanterns through a series of local network distributors might estimate the number of client individuals reached based on the number of units sold. Organizations should footnote details on how and why these assumptions were made. For healthcare providers, “client individuals” refers to patients. For housing providers, “client individuals” refers to residents or tenants. This metric is multi-dimensional with regard to the five dimensions of impact It may help describe the WHO dimension when the stakeholder group represented by the metric is the stakeholder group targeted by the investment or organization. It may also help measure the HOW MUCH Scale dimension, which helps estimate the number of the targeted stakeholders experiencing the outcome. For more on the alignment of IRIS metrics to the five dimensions of impact, see IRIS+ and the Five Dimensions of Impact (https://iris.thegiin.org/document/iris-and-the-five-dimensions/). No s…
has description: Number of unique client individuals who were served by the organization and provided access, during the reporting period, to products/services they were unable to access prior to the reporting period. For further clarification, organizations should reference New Access to Water, New Access to Energy, New Access to Education, New Access to Finance, or New Access to Healthcare in the glossary.
definition: Number of unique client individuals who were served by the organization and provided access, during the reporting period, to products/services they were unable to access prior to the reporting period. For further clarification, organizations should reference New Access to Water, New Access to Energy, New Access to Education, New Access to Finance, or New Access to Healthcare in the glossary.
defined by: giin

Client Households: Provided New Access
type: Concept
type: Code
has name: Client Households: Provided New Access
has identifier: PI2845
notation: PI2845
had primary source: PI2845
note: Organizations should footnote all assumptions used, including source of data. See usage guidance for further information.
scope note: This metric is intended to capture the number of unique households that received the organization's products or services during the reporting period and that were unable to access these products and services from organizations in prior periods. Examples of organizations that might report against this metric include those that provide products such as clean cookstoves or water purification systems and those that provide services such as home weatherization. Organizations that provide goods and services at the individual level, such as vaccines or school lunches, may find it more appropriate to report against Client Individuals: Total (PI4060) and related submetrics. Many organizations may not be able to report on the number of client households using direct data. For example, organizations that sell water purification systems through a series of local network distributors might estimate the number of client households reached based on the number of units sold. Organizations should footnote details on how and why these assumptions were made. This metric is multi-dimensional with regard to the five dimensions of impact. It may help describe the WHO dimension when the stakeholder group represented by the metric is the stakeholder group targeted by the investment or organization. It may also help measure the HOW MUCH Scale dimension, which helps estimate the number of the targeted stakeholders experiencing the outcome. For more on the alignment of IRIS metrics to the five dimensions of impact, see IRIS+ and the Five Dimensions of Impact (https://iris.thegiin.org/document/iris-and-the-five-dimensions/). No single metric is sufficient to understand an impact; rather, metrics are selected as a set across all dimensions of impact. When possible, the selection of metrics to measure and describe the five dimensions should be based on best practice and evidence.
has description: Number of unique households that were clients of the organization and provided access, during the reporting period, to products/services they were unable to access prior to the reporting period. For further clarification, organizations should reference New Access to Water, New Access to Energy, New Access to Education, New Access to Finance, or New Access to Healthcare in the glossary.
definition: Number of unique households that were clients of the organization and provided access, during the reporting period, to products/services they were unable to access prior to the reporting period. For further clarification, organizations should reference New Access to Water, New Access to Energy, New Access to Education, New Access to Finance, or New Access to Healthcare in the glossary.
defined by: giin

Water Savings from Services Sold
type: Concept
type: Code
has name: Water Savings from Services Sold
has description: Volume of water saved during the reporting period as a result of the organization's services sold.
definition: Volume of water saved during the reporting period as a result of the organization's services sold.
has identifier: PI2884
notation: PI2884
had primary source: PI2884
note: Organizations should footnote all assumptions used.
scope note: This metric is intended to capture the water savings to consumers from their purchase of the organization’s water-conservation offerings. For example, an organization that helps identify products and methods that conserve water (such as low-flow products, rain-collection devices, irrigation timers, or leak correctors) would report the total water savings to its clients resulting from these provided services. Organizations should take care to use the same reporting period for both the number of clients and the average water savings per client. In some contexts, this metric can serve as an indicator of whether the outcome being sought by an investor or organization is occurring (the WHAT dimension of impact). For more on the alignment of IRIS metrics to the five dimensions of impact, see IRIS+ and the Five Dimensions of Impact (https://iris.thegiin.org/document/iris-and-the-five-dimensions/). No single metric is sufficient to understand an impact; rather, metrics are selected as a set across all dimensions of impact. When possible, the selection of metrics to measure and describe the five dimensions should be based on best practice and evidence.
defined by: giin

Earnings of Distributor Organizations: SME
type: Concept
type: Code
has name: Earnings of Distributor Organizations: SME
has description: Earnings of distributors that are small and medium-sized enterprises (SME) as a result of selling the organization’s products/services during the reporting period.
definition: Earnings of distributors that are small and medium-sized enterprises (SME) as a result of selling the organization’s products/services during the reporting period.
has identifier: PI2888
notation: PI2888
had primary source: PI2888
note: Organizations should footnote all assumptions used.
scope note: This metric is intended to capture the earnings, during the reporting period, of small and medium-sized enterprises (SMEs) that sold the organization’s products or services, either to other distributors (wholesale) or to end clients (retail). Distributors counted under this metric need not exclusively sell the organization’s products or services.
defined by: giin

Individuals Trained: Total
type: Concept
type: Code
has name: Individuals Trained: Total
has description: Number of individuals who received training offered by the organization during the reporting period.
definition: Number of individuals who received training offered by the organization during the reporting period.
has identifier: PI2998
notation: PI2998
had primary source: PI2998
note: Organizations should footnote the type and extent of the training provided, as well as who received that training. See usage guidance for further information.
scope note: This metric is intended to capture the number of individuals who received training services of any type from the organization during the reporting period. Examples include sessions on enterprise or business development, women’s empowerment, or diversity and inclusion, among other learning topics. Organizations should footnote details on the provided trainings. Training may or may not be restricted to clients of the organization and may be either fee-based or provided for free. Organizations should not include training of an organization’s own employees under this metric, which should instead be captured by Employees Trained (OI4229). This metric may apply to organizations operating in microfinance or agriculture, as well as other sectors in which organizations often provide training to clients and other community members. This metric may help describe the HOW MUCH Scale dimension, which helps estimate the number of the targeted stakeholders experiencing the outcome. For more on the alignment of IRIS metrics to the five dimensions of impact, see IRIS+ and the Five Dimensions of Impact (https://iris.thegiin.org/document/iris-and-the-five-dimensions/). No single metric is sufficient to understand an impact; rather, metrics are selected as a set across all dimensions of impact. When possible, the selection of metrics to measure and describe the five dimensions should be based on best practice and evidence.
defined by: giin

Individuals Displaced: Compensated
type: Concept
type: Code
has name: Individuals Displaced: Compensated
has description: Number of individuals displaced as a result of projects supported/financed by the organization who were compensated for their displacement during the reporting period. Organizations should include type and amount of compensation in footnotes.
definition: Number of individuals displaced as a result of projects supported/financed by the organization who were compensated for their displacement during the reporting period. Organizations should include type and amount of compensation in footnotes.
has identifier: PI3009
notation: PI3009
had primary source: PI3009
note: Organizations should footnote all assumptions used.
scope note: This metric is intended to capture the number of individuals (whether clients of the organization or not) displaced from their homes as a result of projects funded by the organization and who are compensated for their resettlement. For example, if the organization constructs a new road and, in the process, displaces 50 people, of whom 30 are compensated, the value of this metric would be 30. Organizations should footnote details of the displacement and corresponding compensation. Organizations are encouraged to report this metric in conjunction with Individuals Displaced: Total (PI1297). For more on this topic, see EBRD’s Resettlement Guidance and Best Practice (https://www.ebrd.com/publications/resettlement-guidance-good-practice.pdf). This metric may most apply to projects involving the construction or renovation of large-scale infrastructure, as well as building projects. This metric is often used by International Finance Institutions (IFIs) as part of infrastructure analysis. This metric is multidimensional with regard to the five dimensions of impact. It may help describe the WHO dimension of impact, which details which stakeholders the investment or enterprise aims to reach with the outcome, and may also describe the HOW MUCH Scale dimension, which helps estimate the number of the targeted stakeholders experiencing the outcome. For more on the alignment of IRIS metrics to the five dimensions of impact, see IRIS+ and the Five Dimensions of Impact (https://iris.thegiin.org/document/iris-and-the-five-dimensions/). No single metric is sufficient to understand an impact; rather, metrics are selected as a set across all dimensions of impact. The selection of metrics to measure and describe the five dimensions should be based on best practice and evidence.
defined by: giin

Supplier Screening Ratio
type: Concept
type: Code
has name: Supplier Screening Ratio
has description: Percentage of supplier organizations during the reporting period that were screened using social and/or environmental criteria.
definition: Percentage of supplier organizations during the reporting period that were screened using social and/or environmental criteria.
has identifier: PI3016
notation: PI3016
had primary source: PI3016
note: Organizations should footnote details regarding the types of criteria used to evaluate supplier organizations and how they conduct screening. See usage guidance for further information.
scope note: This metric is intended to capture the percentage of active suppliers used by the reporting organization that have undergone social/environmental screening. Organizations can include suppliers that were screened in a previous reporting period but should footnote details on the frequency of their screening process. Social and environmental criteria screened could include specific negative practices (e.g., no child labor, no negative environmental impacts) or positive practices (e.g., environmentally friendly manufacturing processes, excellent labor practices). Organizations should footnote which factors are considered. Many organizations may only screen significant supplier organizations or may screen less significant suppliers to a lesser extent. Organizations are encouraged to footnote how their screening policies differ between types of suppliers. Organizations are encouraged to report this metric in conjunction with Supplier Screening Policy (OI4739).
defined by: giin

Number of Potential Renewals
type: Concept
type: Code
has name: Number of Potential Renewals
has description: Number of policies belonging to the organization’s clients that could have been renewed during the reporting period.
definition: Number of policies belonging to the organization’s clients that could have been renewed during the reporting period.
has identifier: PI3069
notation: PI3069
had primary source: PI3069
note: Organizations should footnote specific criteria resulting in expired policies’ ineligibility, as well as all assumptions used. See usage guidance for further information.
scope note: This metric is intended to capture the number of expired policies that could have been renewed during the reporting period (whether they were or not). Organizations should exclude policies that became ineligible for renewal due to clients’ old age, death, or any other reason during the reporting period. Organizations should footnote any criteria that result in ineligibility.
defined by: giin

Level of Stream Connectivity
type: Concept
type: Code
has name: Level of Stream Connectivity
has identifier: PI3113
notation: PI3113
had primary source: PI3113
note: Organizations should footnote all assumptions used, including source(s) of data.
scope note: The metric is intended to capture the level of connectivity of streams or rivers on land managed by the organization as of the end of the reporting period. Put inversely, this metric is intended to capture the degree to which rivers and streams are fragmented, which can negatively impact stream health, land health, and biodiversity within ecosystems. In addition to remote sensing data, organizations may use tools such as WRI's Aqueduct Water Risk Atlas (https://www.wri.org/aqueduct) or WWF-DEG's Water Risk Filter (http://waterriskfilter.panda.org/) to find data on and describe stream connectivity on directly or indirectly managed land. Assessing stream connectivity helps to understand a project’s contribution to preserving biodiversity, as fragmentation of natural habitat is a primary driver of biodiversity loss. This indicator corresponds to the Convention on Biological Diversity’s Aichi Biodiversity Target 11, which aims to improve biodiversity by safeguarding ecosystems, species, and genetic diversity. In some contexts, this metric can serve as an indicator of whether the outcome being sought by an investor or organization is occurring (the WHAT dimension of impact). For more on the alignment of IRIS metrics to the five dimensions of impact, see IRIS+ and the Five Dimensions of Impact (https://iris.thegiin.org/document/iris-and-the-five-dimensions/). No single metric is sufficient to understand an impact; rather, metrics are selected as a set across all dimensions of impact. When possible, the selection of metrics to measure and describe the five dimensions should be based on best practice and evidence.
has description: Describes the level of fragmentation of streams—the extent to which streams and rivers are fragmented into unconnected parts—present on land directly or indirectly controlled by the organization as of the end of the reporting period. Report for hectares controlled at any point during the reporting period. Choose one: - Very low fragmentation - Low fragmentation - Moderate fragmentation - High fragmentation - Very high fragmentation - No data
definition: Describes the level of fragmentation of streams—the extent to which streams and rivers are fragmented into unconnected parts—present on land directly or indirectly controlled by the organization as of the end of the reporting period. Report for hectares controlled at any point during the reporting period. Choose one: - Very low fragmentation - Low fragmentation - Moderate fragmentation - High fragmentation - Very high fragmentation - No data
defined by: giin

Revenue Generated at Directly Supported/Financed Enterprises
type: Concept
type: Code
has name: Revenue Generated at Directly Supported/Financed Enterprises
has description: Revenue of enterprises financed or supported by the organization during the reporting period.
definition: Revenue of enterprises financed or supported by the organization during the reporting period.
has identifier: PI3180
notation: PI3180
had primary source: PI3180
note: Organizations should footnote all assumptions used.
scope note: This metric is intended to capture the revenue of supported organizations, which most likely applies to organizations in the financial and land conservation categories. For land conservation organizations, this metric is intended to cover the revenue of enterprises deriving revenue from the land, such as a sustainable ranching organization leasing access to land, as opposed to enterprises that provide services to maintain the land, such as a pest control organization. Organizations earning revenue through sustainable economic activity on hectares directly controlled are encouraged to report this metric in conjunction with Land Directly Controlled: Sustainably Managed (OI6912).
defined by: giin

Client Individuals: Poor
type: Concept
type: Code
has name: Client Individuals: Poor
has description: Number of unique poor individuals who were clients of the organization during the reporting period.
definition: Number of unique poor individuals who were clients of the organization during the reporting period.
has identifier: PI3193
notation: PI3193
had primary source: PI3193
note: Organizations should footnote all assumptions used, including source of data, as well as details on the assessment tools used to identify clients’ poverty level. See usage guidance for further information.
scope note: This metric is intended to capture the number of unique poor clients who received the organization's products or services during the reporting period. It is not a measure of foot traffic, nor is it intended to capture the number of consumer transactions. For example, a customer who makes two purchases during a period should be counted only once. Organizations wishing to report on total client transactions should refer to Client Transactions (PI5184). Because assessing the poverty level of stakeholders is complex, organizations will likely use specific assessment tools to accurately report on this metric. See the glossary definition for additional information on commonly used tools to help determine the absolute poverty level of individuals and households. This metric is intended to capture the unique number of specific individuals served. Organizations should not use any household multipliers when reporting against this metric. If organizations consider entire households to be the customer/client, they can report against Client Households: Total (PI7954) and its associated submetrics. Many organizations may not be able to report on the number of clients using direct data. For example, organizations that sell solar lanterns through a series of local network distributors might estimate the number of client individuals reached based on the number of units sold. Organizations should footnote details on how and why these assumptions were made. For healthcare providers, “client individuals” refers to patients. For housing providers, “client individuals” refers to residents or tenants. This metric is multi-dimensional with regard to the five dimensions of impact. It may help describe the WHO dimension when the stakeholder group represented by the metric is the stakeholder group targeted by the investment or organization. It may also help measure the HOW MUCH Scale dimension, which helps estimate the number of the targeted stakeholders experiencing the outcome. For more on …
defined by: giin

Number of Renewals
type: Concept
type: Code
has name: Number of Renewals
has description: Number of policies belonging to the organization’s clients that were renewed during the reporting period after the coverage term expired.
definition: Number of policies belonging to the organization’s clients that were renewed during the reporting period after the coverage term expired.
has identifier: PI3212
notation: PI3212
had primary source: PI3212
note: Organizations should footnote all assumptions used.
scope note: This metric is intended to capture all policy renewals during the reporting period. Organizations should include in this number any policies that expired in a prior reporting period but are renewed during the current reporting period.
defined by: giin

Public Water Point Coverage
type: Concept
type: Code
has name: Public Water Point Coverage
has description: Number of individuals within a coverage region (defined by a municipality, district, or designated service area) who have primary water access through a public tap as of the end of the reporting period.
definition: Number of individuals within a coverage region (defined by a municipality, district, or designated service area) who have primary water access through a public tap as of the end of the reporting period.
has identifier: PI3218
notation: PI3218
had primary source: PI3218
note: Organizations should footnote all assumptions used, including the bounds of the municipality, district, or service area. For this purpose, organizations should report Client State/Province/Region (PD6806).
scope note: This metric is intended to capture the number of people in a given coverage region who have access to water primarily through public water points. Service coverage is a key indicator for water service providers (see aligned IBNET indicator 1.3). The need to estimate the population served by public water points may affect the confidence that can be placed on the service coverage measure. The WHO Global Water Supply and Sanitation Assessment 2000 defined reasonable access as “the availability of at least 20 litres per person per day from a source within one kilometer of the user’s dwelling.” Water.org recommends that organizations use "population within 250m of a public water point" as the underlying definition for this metric. This metric may help describe the HOW MUCH Scale dimension, which helps estimate the number of the targeted stakeholders experiencing the outcome. For more on the alignment of IRIS metrics to the five dimensions of impact, see IRIS+ and the Five Dimensions of Impact (https://iris.thegiin.org/document/iris-and-the-five-dimensions/). No single metric is sufficient to understand an impact; rather, metrics are selected as a set across all dimensions of impact. The selection of metrics to measure and describe the five dimensions should be based on best practice and evidence.
defined by: giin

Length of Streams Present
type: Concept
type: Code
has name: Length of Streams Present
has description: Length of freshwater streams present during the reporting period on protected land, land under sustainable stewardship, or land under sustainable cultivation.
definition: Length of freshwater streams present during the reporting period on protected land, land under sustainable stewardship, or land under sustainable cultivation.
has identifier: PI3239
notation: PI3239
had primary source: PI3239
note: Organizations should footnote all assumptions used.
scope note: This metric is intended to capture the length of streams present on land directly or indirectly controlled by the organization during the reporting period. A stream refers to a natural flowing body of water. It typically has a current and is confined within a bed and stream banks. Organizations are encouraged to report this metric in conjunction with Land Directly Controlled: Sustainably Managed (OI6912), Land Indirectly Controlled: Sustainably Managed (PI6796), and Protected Land Area (PI4716).
defined by: giin

Value of Voluntary Savings Accounts
type: Concept
type: Code
has name: Value of Voluntary Savings Accounts
has description: Value of voluntary savings accounts managed by the organization, including demand deposits and time deposits, as of the end of the reporting period.
definition: Value of voluntary savings accounts managed by the organization, including demand deposits and time deposits, as of the end of the reporting period.
has identifier: PI3240
notation: PI3240
had primary source: PI3240
note: Organizations should footnote all assumptions used. See usage guidance for further information.
scope note: This metric is intended to capture the value of voluntary savings accounts the organization manages as of the end of the reporting period. Organizations are encouraged to footnote information on the average and median balances of the voluntary savings accounts managed, additional data points that can help estimate the typical savings level among the accounts’ owners. The average account balance can be calculated by dividing this metric by the Number of Voluntary Savings Accounts (PI6439). Organizations reporting this metric may include savings programs with incentives or obligatory savings that clients can opt into (not including guarantees). While this metric measures the value of formal savings (voluntary savings accounts), those interested in measuring financial health may also wish to measure or estimate informal and non-cash savings. In specific contexts, and based on evidence, this metric may serve as a proxy indicator of whether the outcome being sought by an investor or organization is occurring (the WHAT dimension of impact). For more on the alignment of IRIS metrics to the five dimensions of impact, see IRIS+ and the Five Dimensions of Impact (https://iris.thegiin.org/document/iris-and-the-five-dimensions/). No single metric is sufficient to understand an impact; rather, metrics are selected as a set across all dimensions of impact. When possible, the selection of metrics to measure and describe the five dimensions should be based on best practice and evidence.
defined by: giin

Client Households: Historically Marginalized
type: Concept
type: Code
has name: Client Households: Historically Marginalized
has description: Number of unique households with at least one household member who belongs to a group historically marginalized on the basis of race and/or ethnicity and that were clients of the organization during the reporting period.
definition: Number of unique households with at least one household member who belongs to a group historically marginalized on the basis of race and/or ethnicity and that were clients of the organization during the reporting period.
has identifier: PI3268
notation: PI3268
had primary source: PI3268
note: Organizations should footnote all assumptions used, including source of data and definition of historically marginalized. See usage guidance for further information.
scope note: This metric is intended to capture the number of unique households that received the organization's products or services during the reporting period and that had at least one household member who belongs to a group historically marginalized on the basis of race and/or ethnicity. Examples of organizations that might report against this metric include those that provide products such as clean cookstoves or water purification systems and those that provide services such as home weatherization. Organizations that provide goods and services at the individual level, such as vaccines or school lunches, may find it more appropriate to report against Client Individuals: Total (PI4060) and related submetrics. Many organizations may not be able to report on the number of client households using direct data. For example, organizations that sell water purification systems through a series of local network distributors might estimate the number of client households reached based on the number of units sold. Organizations should footnote details on how and why these assumptions were made. This metric is multi-dimensional with regard to the five dimensions of impact. It may help describe the WHO dimension when the stakeholder group represented by the metric is the stakeholder group targeted by the investment or organization. It may also help measure the HOW MUCH Scale dimension, which helps estimate the number of the targeted stakeholders experiencing the outcome. For more on the alignment of IRIS metrics to the five dimensions of impact, see IRIS+ and the Five Dimensions of Impact (https://iris.thegiin.org/document/iris-and-the-five-dimensions/). No single metric is sufficient to understand an impact; rather, metrics are selected as a set across all dimensions of impact. When possible, the selection of metrics to measure and describe the five dimensions should be based on best practice and evidence.
defined by: giin

Client Time Savings
type: Concept
type: Code
has name: Client Time Savings
has description: Number of hours saved by clients as a result of the organization’s products and services during the reporting period.
definition: Number of hours saved by clients as a result of the organization’s products and services during the reporting period.
has identifier: PI3291
notation: PI3291
had primary source: PI3291
note: Organizations should footnote all assumptions used.
scope note: This metric is intended to capture the amount of time clients save as a result of using the organization’s products or services. For example, this metric can capture decreased journey or wait times in transportation, time savings in gathering fuel for cooking or other uses, or reduced wait times at health centers, among other uses. This measure captures the efficiency of services provided, which is an indicator of service quality. This metric is often used by International Finance Institutions (IFIs) as part of infrastructure analysis. This metric may help describe the HOW MUCH Scale dimension, which helps estimate the number of the targeted stakeholders experiencing the outcome. For more on the alignment of IRIS metrics to the five dimensions of impact, see IRIS+ and the Five Dimensions of Impact (https://iris.thegiin.org/document/iris-and-the-five-dimensions/). No single metric is sufficient to understand an impact; rather, metrics are selected as a set across all dimensions of impact. The selection of metrics to measure and describe the five dimensions should be based on best practice and evidence.
defined by: giin

Number of Individual Connections
type: Concept
type: Code
has name: Number of Individual Connections
has description: Number of connections to utilities and services provided to individuals by the organization as of the end of the reporting period.
definition: Number of connections to utilities and services provided to individuals by the organization as of the end of the reporting period.
has identifier: PI3317
notation: PI3317
had primary source: PI3317
scope note: This metric is intended to capture the number of individual-level connections to utilities and other services. Organizations should report this metric in conjunction with Connection Type (PD1310) to disaggregate connections in more detail. For example, disaggregating Number of Individual Connections (P3317) by Connection Type (PD1310), option "Phone: Mobile," would yield the number of mobile-phone connections provided by the organization to individuals during the reporting period. This metric may help describe the HOW MUCH Scale dimension, which helps estimate the number of the targeted stakeholders experiencing the outcome. For more on the alignment of IRIS metrics to the five dimensions of impact, see IRIS+ and the Five Dimensions of Impact (https://iris.thegiin.org/document/iris-and-the-five-dimensions/). No single metric is sufficient to understand an impact; rather, metrics are selected as a set across all dimensions of impact. When possible, the selection of metrics to measure and describe the five dimensions should be based on best practice and evidence.
defined by: giin

School Enrollment: Peri-urban
type: Concept
type: Code
has name: School Enrollment: Peri-urban
has description: Number of students residing in peri-urban areas enrolled as of the end of the reporting period, both full- and part-time, with each discrete student counted once regardless of their number of courses.
definition: Number of students residing in peri-urban areas enrolled as of the end of the reporting period, both full- and part-time, with each discrete student counted once regardless of their number of courses.
has identifier: PI3337
notation: PI3337
had primary source: PI3337
note: Organizations should footnote all assumptions used, as well as a breakdown of full- and part-time students residing in peri-urban areas.
scope note: This metric is intended to capture the number of students who live in peri-urban areas and who are enrolled at the school as of the end of the reporting period. This metric includes full-time and part-time students. Each discrete student should be counted once, regardless of number of courses taken. These data may be most effectively collected through either school reporting (for private schools) or government reporting (for public schools). This metric is multi-dimensional with regard to the five dimensions of impact. It may help describe the WHO dimension when the stakeholder group represented by the metric is the stakeholder group targeted by the investment or organization. It may also help measure the HOW MUCH Scale dimension, which helps estimate the number of the targeted stakeholders experiencing the outcome. For more on the alignment of IRIS metrics to the five dimensions of impact, see IRIS+ and the Five Dimensions of Impact (https://iris.thegiin.org/document/iris-and-the-five-dimensions/). No single metric is sufficient to understand an impact; rather, metrics are selected as a set across all dimensions of impact. When possible, the selection of metrics to measure and describe the five dimensions should be based on best practice and evidence.
defined by: giin

Claims Rejected
type: Concept
type: Code
has name: Claims Rejected
has description: Number of claims submitted to the organization that were rejected during the reporting period.
definition: Number of claims submitted to the organization that were rejected during the reporting period.
has identifier: PI3383
notation: PI3383
had primary source: PI3383
note: Organizations should footnote all assumptions used, as well as the reasons for rejecting claims. See usage guidance for further information.
scope note: This metric is intended to capture the number of claims that were disqualified from benefit payment (in other words, rejected) for any reason. Examples of reasons for which claims might be rejected, to footnote, include, among others, submission for uncovered events, submission before a waiting period has lapsed, or claim by an insured person who is no longer covered (due, for instance, to expiration of the coverage period or attainment of maximum eligible age).
defined by: giin

Payments to Supplier Individuals: Urban
type: Concept
type: Code
has name: Payments to Supplier Individuals: Urban
has description: Value of payments made by the organization to individuals residing in urban areas who sold goods or services to the organization during the reporting period.
definition: Value of payments made by the organization to individuals residing in urban areas who sold goods or services to the organization during the reporting period.
has identifier: PI3406
notation: PI3406
had primary source: PI3406
note: Organizations should footnote all assumptions used.
scope note: This metric is intended to capture how organizations support the livelihoods of individuals residing in urban areas through their supply chains.
defined by: giin

Average Client Agricultural Yield: Total
type: Concept
type: Code
has name: Average Client Agricultural Yield: Total
has description: Average agricultural yield per hectare of clients (who were farmers) of the organization during the reporting period.
definition: Average agricultural yield per hectare of clients (who were farmers) of the organization during the reporting period.
has identifier: PI3468
notation: PI3468
had primary source: PI3468
note: Organizations should footnote all assumptions used, including source of data and unit of measure reporting against (such as kilograms or bushels per hectare) using Unit of Measure (PD1602).
scope note: NOTE: This metric will be deprecated in a forthcoming update to the IRIS Catalog of Metrics. Users are advised to instead report Average Agricultural Yield (PI5935), applied to Client Individuals: Total (PI4060). This metric is intended to capture the average output per hectare for farmers among an organization's clients. Organizations should not calculate this metric using aggregate data across all farmers. Rather, as noted in the calculation, organizations should use farmer-specific data. Organizations should report yield from the most recent harvest and footnote details on the unit of measure. This metric could be valuable for organizations that sell inputs (such as fertilizer or irrigation equipment) to farmers that help improve yields. Organizations interested in reporting the yields of supplier farmers should report Average Supplier Agriculture Yield: Total (PI2046). In some contexts, this metric can serve as an indicator of whether the outcome being sought by an investor or organization is occurring (the WHAT dimension of impact). For more on the alignment of IRIS metrics to the five dimensions of impact, see IRIS+ and the Five Dimensions of Impact (https://iris.thegiin.org/document/iris-and-the-five-dimensions/). No single metric is sufficient to understand an impact; rather, metrics are selected as a set across all dimensions of impact. When possible, the selection of metrics to measure and describe the five dimensions should be based on best practice and evidence.
defined by: giin

Product Hours of Light Available
type: Concept
type: Code
has name: Product Hours of Light Available
has description: Number of hours of light available from the product during the reporting period.
definition: Number of hours of light available from the product during the reporting period.
has identifier: PI3486
notation: PI3486
had primary source: PI3486
note: Organizations should footnote all assumptions made, especially those regarding product utilization. An example of such an assumption includes watts/hour used.
scope note: This metric is intended to capture hours of light made available by a product from the organization during the reporting period, not hours of light made available throughout the product’s lifetime. For light provided over the product’s lifetime, organizations should report Energy Consumption of Product (PD6596), which can be used to gauge efficiency gains associated with the product. This metric is intended to capture hours of light made available by the product, not hours of light available as a result of sunshine or any other source of light. In specific contexts, and based on evidence, this metric may serve as a proxy indicator of whether the outcome being sought by an investor or organization is occurring (the WHAT dimension of impact). For more on the alignment of IRIS metrics to the five dimensions of impact, see IRIS+ and the Five Dimensions of Impact (https://iris.thegiin.org/document/iris-and-the-five-dimensions/). No single metric is sufficient to understand an impact; rather, metrics are selected as a set across all dimensions of impact. When possible, the selection of metrics to measure and describe the five dimensions should be based on best practice and evidence.
defined by: giin

Students Provided Partial Scholarship
type: Concept
type: Code
has name: Students Provided Partial Scholarship
has description: Number of students receiving partial scholarships during the reporting period.
definition: Number of students receiving partial scholarships during the reporting period.
has identifier: PI3499
notation: PI3499
had primary source: PI3499
note: Organizations should footnote the details on scholarship eligibility requirements, who provides scholarship funding, average scholarship amounts as a percentage of full tuition/fees, and any other relevant details.
scope note: This metric is intended to capture the number of students receiving partial scholarship. Partial scholarships allow a student to attend school with partial, but not total, tuition or fee payment required of the student or their family.
defined by: giin

Job Placement Rate
type: Concept
type: Code
has name: Job Placement Rate
has description: Percentage of the organization’s clients who were placed in part-time, full-time, temporary, or permanent jobs during the reporting period.
definition: Percentage of the organization’s clients who were placed in part-time, full-time, temporary, or permanent jobs during the reporting period.
has identifier: PI3527
notation: PI3527
had primary source: PI3527
note: Organizations should footnote all assumptions used. See usage guidance for further information.
scope note: This metric is intended to capture the percentage of clients (for example, job services clients or students in vocational or technical training) who were placed in jobs during the reporting period. Organizations should include only those clients who were placed in and began jobs during the reporting period. They should exclude clients who were placed in jobs but did not begin work. Organizations are also encouraged to provide details on the types of activities they conducted to increase job placement rates, such as (but not limited to): monitoring workforce trends to ensure alignment between program offerings and workforce needs, surveying employers (to capture position offerings, skills needed, and likely wages), strengthening relationships with potential employers, providing resources (such as interview tips, career fairs, and job leads) to assist job searches and career development, and creating program alumni networks. In the case of employees assisted to find jobs, organizations may use total employees assisted as the denominator in this formula, calculated as: Permanent Employees: Total (OI8869) + Temporary Employees (OI9028), disaggregated into the number of employees using the job-placement benefit specified by Employment Benefits (OI2742). For work integrating social enterprises (WISE), a high job placement rate is an indicator of success. High rates of voluntary turnover can also be an indicator of success along these lines, which organizations can capture using Employee Voluntary Turnover Rate (OI1638). This metric is multi-dimensional with regard to the five dimensions of impact. In some contexts, this metric can serve as an indicator of whether the outcome being sought by an investor or organization is occurring (the WHAT dimension of impact). It may also help measure the HOW MUCH Scale dimension, which helps estimate the number of the targeted stakeholders experiencing the outcome. For more on the alignment of IRIS metrics to the five dimensions of imp…
defined by: giin

Child Stunting Prevalence
type: Concept
type: Code
has name: Child Stunting Prevalence
has description: Ratio of children within the area served by the organization who experienced stunting as of the end of the reporting period.
definition: Ratio of children within the area served by the organization who experienced stunting as of the end of the reporting period.
has identifier: PI3594
notation: PI3594
had primary source: PI3594
note: Organizations should footnote all assumptions used, including source of data.
scope note: This metric is intended to capture the prevalence of stunting among children in the region served by the organization. The World Health Organization (WHO) defines stunting as height less than two standard deviations from the median of the WHO's Child Growth Standards. Stunting often results from malnutrition and other factors correlated with poverty. Sources for these data at the regional or national level include the WHO (https://www.who.int/nutrition/databases/en/) and USAID's Demographic and Health Surveys Program Database (https://dhsprogram.com/Data/).
defined by: giin

Teacher Attendance Rate
type: Concept
type: Code
has name: Teacher Attendance Rate
has description: Rate of teacher attendance during the reporting period.
definition: Rate of teacher attendance during the reporting period.
has identifier: PI3651
notation: PI3651
had primary source: PI3651
note: Organizations should footnote all assumptions used, including details on how teacher attendance is tracked.
scope note: This metric is intended to capture teacher attendance in school. When calculating this metric, the number of days teachers were absent during the reporting period should equal the sum of the total number of days per teacher. For example, if two teachers were absent on the same day, the number of days absent would be 2.
defined by: giin

Jobs Created at Directly Supported/Financed Enterprises: Total
type: Concept
type: Code
has name: Jobs Created at Directly Supported/Financed Enterprises: Total
has identifier: PI3687
notation: PI3687
had primary source: PI3687
note: Organizations should footnote all assumptions used. Organizations that report data for more than one reporting period should be careful to very clearly footnote which they are using for this metric. See usage guidance for further information.
scope note: This metric is intended to capture jobs created at supported organizations during the reporting period. Organizations are encouraged to use this metric with Jobs Type (OD0660) to enable disaggregation of these data by key aspects. Organizations may choose to disclose employment by function (for example, operations and maintenance, construction, or land conservation). To align to the HIPSO (Harmonized Indicators for Private Sector Operations) indicator Direct Jobs Created by the Investment (Operations and Maintenance), organizations should include under Jobs Type (OD0660) only the options, “Hiring: Jobs hired through organization itself” and “Hiring: Jobs hired/supported through a third-party and directly related to the organization’s operations and maintenance of company.” The three metrics for jobs at supported/financed enterprises relate to one another, as follows. Jobs Maintained at Directly Supported/Financed Enterprises: Total (PI5691) and Jobs Created at Directly Supported/Financed Enterprises: Total (PI3687) sum to Jobs in Directly Supported/Financed Enterprises (PI4874). For example, if an investor provided a loan to a small business that had 10 employees at the time the loan was provided and 15 employees as of the end of the reporting period, Jobs Created at Directly Supported/Financed Enterprises: Total (PI3687) would be 5; Jobs in Directly Supported/Financed Enterprises (PI4874) would be 15; and Jobs Maintained at Directly Supported/Financed Enterprises: Total (PI5691) would be 10. Direct jobs in the context of this metric are defined according to the scope of the project (for instance, jobs created at a company that receives investment), following project logic and objectives. For some types of financial intermediaries, organizations should footnote a clear definition of direct jobs. For instance, if measured using a capacity-building approach, direct jobs supported are identified at the direct, operational level. If defined using an economic impact appr…
has description: Net number of new, full-time equivalent employees working for enterprises financed or supported by the organization during the reporting period. Many organizations select the beginning of the reporting period as the time when the organization began its support or investment.
definition: Net number of new, full-time equivalent employees working for enterprises financed or supported by the organization during the reporting period. Many organizations select the beginning of the reporting period as the time when the organization began its support or investment.
defined by: giin

Service Interruptions
type: Concept
type: Code
has name: Service Interruptions
has description: Number of service interruptions experienced by clients during the reporting period.
definition: Number of service interruptions experienced by clients during the reporting period.
has identifier: PI3720
notation: PI3720
had primary source: PI3720
note: Organizations should footnote all assumptions used.
scope note: This metric is intended to capture the number of times within the reporting period that a service—for example, electricity, running water, or internet service—is interrupted or unavailable to clients. Organizations may use Product/Service Detailed Type (PD1516) to describe or disaggregate this metric by services provided. This metric, compared to the total duration of the reporting period, indicates the quality of services provided. Organizations are encouraged to use this metric in combination with Service Hours Provided (PI5683). Organizations may choose to use Service Hours Interrupted (PI2230) to capture the total hours of interruption rather than the number of interruptions. In sanitation-related investments, this metric captures the number of blockages in the sewer system. Blockages can reflect many underlying issues, including the effectiveness of routine operational and maintenance activities, the hydraulic performance of the network, and the general condition of the pipes. The number of blockages comprises administrative data that should come from the service provider (for example, the utility company). This metric is aligned with IBNET 10.1 and 79 (https://www.ib-net.org/toolkit/ibnet-data/sewerage-service/). This metric is often used by International Finance Institutions (IFIs) as part of infrastructure analysis. This metric may help describe the HOW MUCH Scale dimension, which helps estimate the number of the targeted stakeholders experiencing the outcome. For more on the alignment of IRIS metrics to the five dimensions of impact, see IRIS+ and the Five Dimensions of Impact (https://iris.thegiin.org/document/iris-and-the-five-dimensions/). No single metric is sufficient to understand an impact; rather, metrics are selected as a set across all dimensions of impact. The selection of metrics to measure and describe the five dimensions should be based on best practice and evidence.
defined by: giin

Minimum Insurance Premium
type: Concept
type: Code
has name: Minimum Insurance Premium
has description: Minimum annualized insurance premium offered for the insurance product provided by the organization during the reporting period.
definition: Minimum annualized insurance premium offered for the insurance product provided by the organization during the reporting period.
has identifier: PI3734
notation: PI3734
had primary source: PI3734
note: Organizations should footnote all assumptions used.
scope note: This metric is intended to capture the smallest premium charged by an organization selling or underwriting insurance, which in some contexts is a measure of affordability.
defined by: giin

Student Attendance Rate
type: Concept
type: Code
has name: Student Attendance Rate
has description: Rate of student attendance during the reporting period.
definition: Rate of student attendance during the reporting period.
has identifier: PI3786
notation: PI3786
had primary source: PI3786
note: Organizations should footnote all assumptions used, including details on how attendance is tracked.
scope note: This metric is intended to capture student attendance in school. When calculating this metric, the number of absentee days by students during the reporting period should equal the sum of the total number of days per student. For example, if two students were absent on the same day, the number of absentee days would be 2.
defined by: giin

Land Indirectly Controlled: Total
type: Concept
type: Code
has name: Land Indirectly Controlled: Total
has description: Area of land indirectly controlled by the organization during the reporting period.
definition: Area of land indirectly controlled by the organization during the reporting period.
has identifier: PI3789
notation: PI3789
had primary source: PI3789
note: Organizations should footnote details about the nature of the indirect control relationship and all assumptions used, including source of data. See usage guidance for further information.
scope note: The IRIS catalog differentiates between land that the organization directly controls and land that the organization indirectly controls. This metric is intended to capture the area of land that is under the organization's indirect control. Indirect control refers to land that the organization supports or influences but does not directly cultivate or manage. Examples in which an organization indirectly controls land may include purchase contracts or sourcing from farmer cooperatives. Organizations that exert control over land practices of indirectly controlled land should footnote these details (for example, when an organization specifies that farmers adhere to specific environmental practices).
defined by: giin

Units/Volume Purchased from Supplier Individuals: Certified
type: Concept
type: Code
has name: Units/Volume Purchased from Supplier Individuals: Certified
has description: Certified units/volume purchased from individuals who sold to the reporting organization during the reporting period.
definition: Certified units/volume purchased from individuals who sold to the reporting organization during the reporting period.
has identifier: PI3825
notation: PI3825
had primary source: PI3825
note: Organizations should footnote details on the certification and all other assumptions used, including source of data. See usage guidance for further information.
scope note: This metric is intended to capture the total units or volume an organization purchased during the reporting period from certified suppliers who are individuals. Certification must come from a third party, be based on transparent standards, and have an assurance process. The process of certification must be carried out by a recognized third-party body, independent from interested parties, which demonstrates that a product or organization complies with the requirements defined by the standards or technical specifications. Examples of such certifications include UTZ Certified, Fair Trade (WFTO fair trade standard), Common Code for the Coffee Community (C4), Rainforest Alliance agriculture certification, Marine Stewardship Council (MSC), and the Forest Stewardship Council (FSC). Organizations should footnote relevant details about the certification (such as certification name and certifying body) and can do so by reporting separately on Product/Service Certifications (PD2756). Organizations that purchase different types of products/services should consider reporting separately against each different type of product/service.
defined by: giin

Area of Trees Planted: Native Species
type: Concept
type: Code
has name: Area of Trees Planted: Native Species
has description: Area of land on which the organization planted native species of trees during the reporting period.
definition: Area of land on which the organization planted native species of trees during the reporting period.
has identifier: PI3848
notation: PI3848
had primary source: PI3848
note: Organizations should footnote all assumptions used.
scope note: This metric is intended to capture the planting of native species, a potential indicator of the organization's contribution toward environmental sustainability and positive environmental outcomes. Native species typically require less pesticides and fertilizers in their home territory, which can have environmental benefits.
defined by: giin

Quality Assurance Mechanism
type: Concept
type: Code
has name: Quality Assurance Mechanism
has identifier: PI3863
notation: PI3863
had primary source: PI3863
note: Organizations should footnote details and descriptions of the mechanisms used (especially if selecting ‘Other’) and how they are linked to quality-improvement activities and plans. See usage guidance for further information.
scope note: This metric is intended to capture process measures with evidence-based correlations to improvements in clinical quality, though they may not apply to all organizations operating in health services. Please see the glossary term Quality Assurance Mechanisms for more details on each of these options. This list of quality assurance mechanisms was adapted from the results of a systematic review of quality assurance best practices by the NHS (http://evidencecentre.com/Best%20practice%20in%20clinical%20quality%20assurance.pdf).
has description: Describes the quality assurance mechanisms that were in place at the organization during the reporting period. Select all that apply: - Peer review/supervision - Audit and feedback - Checklists and logs - Electronic monitoring systems - Communication and education strategies - Guidelines, protocols, and registries - Other
definition: Describes the quality assurance mechanisms that were in place at the organization during the reporting period. Select all that apply: - Peer review/supervision - Audit and feedback - Checklists and logs - Electronic monitoring systems - Communication and education strategies - Guidelines, protocols, and registries - Other
defined by: giin

Healthcare Crude Coverage
type: Concept
type: Code
has name: Healthcare Crude Coverage
has description: Percentage of the organization's clients (patients) who received necessary health intervention(s) during the reporting period.
definition: Percentage of the organization's clients (patients) who received necessary health intervention(s) during the reporting period.
has identifier: PI3902
notation: PI3902
had primary source: PI3902
note: Organizations should footnote the expected time frame and clinical protocols that define a completed treatment, in addition to all other assumptions used. See usage guidance for further information.
scope note: This metric is intended to capture the percentage of patients who received treatment that they needed during the reporting period. The denominator of this calculation is the number of clients who needed treatment during the reporting period. Examples of interventions to which this metric might apply include the following: - Percentage of pregnant patients who attended required antenatal care visits during the reporting period. - Percentage of patients who received counseling during the reporting period. Healthcare Crude Coverage (PI3902) is an input into Healthcare Effective Coverage (PI7191) – crude coverage is a simple measure of percent of patients needing treatment who received it during the reporting period, while effective coverage includes a measure of quality. Both can be applied at a national, individual, or organizational level; investors are encouraged to apply them at the level of the investee company. While crude coverage is more widely used, experts are increasingly encouraging use of the quality-inclusive effective coverage measure. For further details on these measures and practical application in the investment context, see IADB’s "The Use of Effective Coverage in the Evaluation of Maternal and Child Health Programs: A Technical Note for the IDB’s Social Protection and Health” (https://publications.iadb.org/publications/english/document/The-Use-of-Effective-Coverage-in-the-Evaluation-of-Maternal-and-Child-Health-Programs-A-Technical-Note-for-the-IDB-Social-Protection-and-Health-Division.pdf) and “Effective coverage as a new approach to health system performance assessment: a scoping review” (https://bmchealthservres.biomedcentral.com/articles/10.1186/s12913-018-3692-7). For background on the measure itself, see “Access, utilization, quality, and effective coverage: an integrated conceptual framework and measurement strategy” (https://www.sciencedirect.com/science/article/abs/pii/S0277953604006070?via%3Dihub). In specific contexts, and based on evide…
defined by: giin

Protected Land Area: Permanent
type: Concept
type: Code
has name: Protected Land Area: Permanent
has description: Area of land with permanently protected status as of the end of the reporting period.
definition: Area of land with permanently protected status as of the end of the reporting period.
has identifier: PI3924
notation: PI3924
had primary source: PI3924
note: Organizations should footnote the methods applied to ensure protected land status. See usage guidance for further information.
scope note: This metric is intended to capture the number of hectares that the organization has under permanent protected status as of the end of the reporting period. A state of permanent protection results from legal encumbrances placed on the land or the transfer of ownership to a qualified conservation organization. If relevant, organizations are encouraged to footnote which, and which type of qualified conservation organization owns the land under permanent conservation status.
defined by: giin

Client Individuals: Peri-urban
type: Concept
type: Code
has name: Client Individuals: Peri-urban
has description: Number of unique individuals residing in peri-urban areas who were clients of the organization during the reporting period.
definition: Number of unique individuals residing in peri-urban areas who were clients of the organization during the reporting period.
has identifier: PI3960
notation: PI3960
had primary source: PI3960
note: Organizations should footnote all assumptions used, including source of data. See usage guidance for further information.
scope note: This metric is intended to capture the number of unique peri-urban clients who received the organization’s products or services during the reporting period. It is not a measure of foot traffic, nor is it intended to capture the number of consumer transactions. For example, a customer who makes two purchases during a period should be counted only once. Organizations wishing to report on total client transactions should refer to Client Transactions (PI5184). This metric is intended to capture the unique number of specific individuals served. Organizations should not use any household multipliers when reporting against this metric. If organizations consider entire households to be the customer/client, they can report against Client Households: Total (PI7954) and its associated submetrics. Many organizations may not be able to report on the number of clients using direct data. For example, organizations that sell solar lanterns through a series of local network distributors might estimate the number of client individuals reached based on the number of units sold. Organizations should footnote details on how and why these assumptions were made. For healthcare providers, “client individuals” refers to patients. For housing providers, “client individuals” refers to residents or tenants. This metric is multi-dimensional with regard to the five dimensions of impact. It may help describe the WHO dimension when the stakeholder group represented by the metric is the stakeholder group targeted by the investment or organization. It may also help measure the HOW MUCH Scale dimension, which helps estimate the number of the targeted stakeholders experiencing the outcome. For more on the alignment of IRIS metrics to the five dimensions of impact, see IRIS+ and the Five Dimensions of Impact (https://iris.thegiin.org/document/iris-and-the-five-dimensions/). No single metric is sufficient to understand an impact; rather, metrics are selected as a set across all dimensions of impact. Whe…
defined by: giin

Earnings of Distributor Individuals: Poor
type: Concept
type: Code
has name: Earnings of Distributor Individuals: Poor
has description: Earnings of poor individual distributors as a result of selling the organization’s products/services during the reporting period.
definition: Earnings of poor individual distributors as a result of selling the organization’s products/services during the reporting period.
has identifier: PI3962
notation: PI3962
had primary source: PI3962
note: Organizations should footnote all assumptions used, including details on the assessment tools used to identify the poverty level of distributors. See usage guidance for further information.
scope note: This metric is intended to capture the total gross margin earned by, or commission paid to, individual poor distributors, a measure of how organizations support the livelihoods of individuals living in poverty through their distribution chains. Because assessing the poverty level of stakeholders is complex, organizations will likely have to use specific assessment tools to accurately report on this metric. See the glossary definition for additional information on commonly used tools to help determine the absolute poverty level of individuals and households.
defined by: giin

Distributor Individuals: Rural
type: Concept
type: Code
has name: Distributor Individuals: Rural
has description: Number of individuals residing in rural areas who served as distributors of the organization’s products/services during the reporting period.
definition: Number of individuals residing in rural areas who served as distributors of the organization’s products/services during the reporting period.
has identifier: PI3972
notation: PI3972
had primary source: PI3972
note: Organizations should footnote all assumptions used.
scope note: This metric is intended to capture how many self-employed rural individuals sold the organization’s products or services, either to other distributors (wholesale) or to ultimate consumers (retail), during the reporting period. Distributors counted under this metric need not exclusively sell the organization’s products or services. Direct employees who distribute the organization’s goods or services should be considered employees, not distributors. This metric is multi-dimensional with regard to the five dimensions of impact: it may help describe the WHO dimension when the stakeholder group represented by the metric is the stakeholder group targeted by the investment or organization. It may also help measure the HOW MUCH Scale dimension, which helps estimate the number of the targeted stakeholders experiencing the outcome. For more on the alignment of IRIS metrics to the five dimensions of impact, see IRIS+ and the Five Dimensions of Impact (https://iris.thegiin.org/document/iris-and-the-five-dimensions/). No single metric is sufficient to understand an impact; rather, metrics are selected as a set across all dimensions of impact. When possible, the selection of metrics to measure and describe the five dimensions should be based on best practice and evidence.
defined by: giin

Distributor Individuals: Peri-urban
type: Concept
type: Code
has name: Distributor Individuals: Peri-urban
has description: Number of individuals residing in peri-urban areas who served as distributors of the organization’s products/services during the reporting period.
definition: Number of individuals residing in peri-urban areas who served as distributors of the organization’s products/services during the reporting period.
has identifier: PI3995
notation: PI3995
had primary source: PI3995
note: Organizations should footnote all assumptions used.
scope note: This metric is intended to capture how many self-employed peri-urban individuals sold the organization’s products or services, either to other distributors (wholesale) or to ultimate consumers (retail), during the reporting period. Distributors counted under this metric need not exclusively sell the organization’s products or services. Direct employees who distribute the organization’s goods or services should be considered employees, not distributors. This metric is multi-dimensional with regard to the five dimensions of impact: it may help describe the WHO dimension when the stakeholder group represented by the metric is the stakeholder group targeted by the investment or organization. It may also help measure the HOW MUCH Scale dimension, which helps estimate the number of the targeted stakeholders experiencing the outcome. For more on the alignment of IRIS metrics to the five dimensions of impact, see IRIS+ and the Five Dimensions of Impact (https://iris.thegiin.org/document/iris-and-the-five-dimensions/). No single metric is sufficient to understand an impact; rather, metrics are selected as a set across all dimensions of impact. When possible, the selection of metrics to measure and describe the five dimensions should be based on best practice and evidence.
defined by: giin

Client Individuals: Total
type: Concept
type: Code
has name: Client Individuals: Total
has description: Number of unique individuals who were clients of the organization during the reporting period.
definition: Number of unique individuals who were clients of the organization during the reporting period.
has identifier: PI4060
notation: PI4060
had primary source: PI4060
note: Organizations should footnote all assumptions used, including source of data. See usage guidance for further information.
scope note: This metric is intended to capture the number of unique clients who received the organization's products or services during the reporting period. It is not a measure of foot traffic, nor is it intended to capture the number of consumer transactions. For example, a customer who makes two purchases during a period should be counted only once. Organizations wishing to report on total client transactions should refer to Client Transactions (PI5184). This metric is intended to capture the unique number of specific individuals served. Organizations should not use any household multipliers when reporting against this metric. If organizations consider entire households to be the customer/client, they can report against Client Households: Total (PI7954) and its associated submetrics. Many organizations may not be able to report on the number of clients using direct data. For example, organizations that sell solar lanterns through a series of local network distributors might estimate the number of client individuals reached based on the number of units sold. Organizations should footnote details on how and why these assumptions were made. For healthcare providers, “client individuals” refers to patients. For housing providers, “client individuals” refers to residents or tenants. This metric is multi-dimensional with regard to the five dimensions of impact. It may help describe the WHO dimension when the stakeholder group represented by the metric is the stakeholder group targeted by the investment or organization. It may also help measure the HOW MUCH Scale dimension, which helps estimate the number of the targeted stakeholders experiencing the outcome. For more on the alignment of IRIS metrics to the five dimensions of impact, see IRIS+ and the Five Dimensions of Impact (https://iris.thegiin.org/document/iris-and-the-five-dimensions/). No single metric is sufficient to understand an impact; rather, metrics are selected as a set across all dimensions of impact. When possible,…
defined by: giin

Payments to Supplier Individuals: Rural
type: Concept
type: Code
has name: Payments to Supplier Individuals: Rural
has description: Value of payments made by the organization to individuals residing in rural areas who sold goods or services to the organization during the reporting period.
definition: Value of payments made by the organization to individuals residing in rural areas who sold goods or services to the organization during the reporting period.
has identifier: PI4096
notation: PI4096
had primary source: PI4096
note: Organizations should footnote all assumptions used.
scope note: This metric is intended to capture how organizations support the livelihoods of individuals residing in rural areas through their supply chains.
defined by: giin

Area of Trees Planted: Total
type: Concept
type: Code
has name: Area of Trees Planted: Total
has description: Area of land on which the organization planted trees during the reporting period.
definition: Area of land on which the organization planted trees during the reporting period.
has identifier: PI4127
notation: PI4127
had primary source: PI4127
note: Organizations should footnote all assumptions used.
scope note: This metric is intended to capture the planting of new trees, a potential indicator of the organization's contribution toward environmental sustainability.
defined by: giin

Products Recalled
type: Concept
type: Code
has name: Products Recalled
has description: Number of recalls of the organization’s products during the last reporting period.
definition: Number of recalls of the organization’s products during the last reporting period.
has identifier: PI4128
notation: PI4128
had primary source: PI4128
note: Organizations should footnote the details and descriptions of these recalls. See usage guidance for further information.
scope note: This metric is intended to capture recalls of the organization’s products. Organizations should footnote how the recalls break down into (a) voluntary and (b) mandatory categories. Mandatory recalls are those that are mandated by a regulatory body. Organizations are also encouraged to include information on the number of products sold in each line of recalled products.
defined by: giin

Value of Equity Investments Closed
type: Concept
type: Code
has name: Value of Equity Investments Closed
has description: Value of equity investments closed by the organization during the reporting period.
definition: Value of equity investments closed by the organization during the reporting period.
has identifier: PI4142
notation: PI4142
had primary source: PI4142
note: Organizations should footnote all assumptions used. See usage guidance for further information.
scope note: This metric is intended to capture the value of equity investments completed during the reporting period, not the number of investments exited. In an equity investment, in exchange for investment funds, the organization receives an ownership interest in the equity (stock) of the enterprise, either common or preferred stock. Values should be reported at book value for non-traded equities and at market rate for marketable securities. Organizations are encouraged to footnote whether their equity is held directly in enterprises or through funds.
defined by: giin

After-sale Client Support
type: Concept
type: Code
has name: After-sale Client Support
has description: Indicates whether the organization provides support to its clients after a sale of its product/service.
definition: Indicates whether the organization provides support to its clients after a sale of its product/service.
has identifier: PI4180
notation: PI4180
had primary source: PI4180
note: Organizations should footnote the type of support that is provided, costing information, and details on how clients can access these services.
scope note: This metric is intended to capture whether an organization provides after-sale support, which can include a range of services to help clients use a product they purchased from the organization, including but not limited to assistance in installation, product use training, troubleshooting, maintenance, and upgrade or disposal of the product.
defined by: giin

Client Individuals: Historically Marginalized
type: Concept
type: Code
has name: Client Individuals: Historically Marginalized
has description: Number of unique individuals who belong to groups historically marginalized on the basis of race and/or ethnicity who were clients of the organization during the reporting period.
definition: Number of unique individuals who belong to groups historically marginalized on the basis of race and/or ethnicity who were clients of the organization during the reporting period.
has identifier: PI4237
notation: PI4237
had primary source: PI4237
note: Organizations should footnote all assumptions used, including their categorization of historically marginalized groups. See usage guidance for further information.
scope note: This metric is intended to capture the number of unique clients who belong to a group historically marginalized on the basis of race and/or ethnicity and who received the organization’s products or services during the reporting period. It is not a measure of foot traffic, nor is it intended to capture the number of consumer transactions. For example, a customer who makes two purchases during a period should be counted only once. Organizations wishing to report on total client transactions should refer to Client Transactions (PI5184). This metric is intended to capture the unique number of specific individuals served. Organizations should not use any household multipliers when reporting against this metric. If organizations consider entire households to be the customer/client, they can report against Client Households: Total (PI7954) and its associated submetrics. The categorization of historically marginalized groups varies with location and context. With no internationally agreed-upon definition as to which groups constitute historically marginalized, if well-established local policies exist (as in South Africa, with the Broad Based Black Economic Empowerment [BBBEE] definition, or in India, based on backward caste), organizations should refer to these local guidelines to identify groups historically marginalized on the basis of race and/or ethnicity. Otherwise, and wherever appropriate, organizations should provide additional detail regarding their tailored methodology for defining these groups. Many organizations may not be able to report on the number of clients using direct data. For example, organizations that sell solar lanterns through a series of local network distributors might estimate the number of client individuals reached based on the number of units sold. Organizations should footnote details on how and why these assumptions were made. For healthcare providers, “client individuals” refers to patients. For housing providers, “client individuals” refer…
defined by: giin

Student to Toilet Ratio
type: Concept
type: Code
has name: Student to Toilet Ratio
has description: Number of students per functioning toilet during the reporting period.
definition: Number of students per functioning toilet during the reporting period.
has identifier: PI4243
notation: PI4243
had primary source: PI4243
note: Organizations should footnote all assumptions used.
scope note: This metric is intended to capture the availability of working toilets for students of an organization during the reporting period. In some contexts, this metric can serve as an indicator of whether the outcome being sought by an investor or organization is occurring (the WHAT dimension of impact). For more on the alignment of IRIS metrics to the five dimensions of impact, see IRIS+ and the Five Dimensions of Impact (https://iris.thegiin.org/document/iris-and-the-five-dimensions/). No single metric is sufficient to understand an impact; rather, metrics are selected as a set across all dimensions of impact. When possible, the selection of metrics to measure and describe the five dimensions should be based on best practice and evidence.
defined by: giin

Educational Resource to Student Ratio
type: Concept
type: Code
has name: Educational Resource to Student Ratio
has description: Number of textbooks or digital educational resources per student provided by the organization during the reporting period.
definition: Number of textbooks or digital educational resources per student provided by the organization during the reporting period.
has identifier: PI4279
notation: PI4279
had primary source: PI4279
note: Organizations should footnote all assumptions used.
scope note: This metric is intended to capture the educational resources (including textbooks, educational technologies, and other resources) provided per student by the organization during the reporting period. In some contexts, this metric can serve as an indicator of whether the outcome being sought by an investor or organization is occurring (the WHAT dimension of impact). For more on the alignment of IRIS metrics to the five dimensions of impact, see IRIS+ and the Five Dimensions of Impact (https://iris.thegiin.org/document/iris-and-the-five-dimensions/). No single metric is sufficient to understand an impact; rather, metrics are selected as a set across all dimensions of impact. When possible, the selection of metrics to measure and describe the five dimensions should be based on best practice and evidence.
defined by: giin

Earnings of Distributor Individuals: People with Disabilities
type: Concept
type: Code
has name: Earnings of Distributor Individuals: People with Disabilities
has description: Earnings of individual distributors with disabilities as a result of selling the organization’s products/services during the reporting period.
definition: Earnings of individual distributors with disabilities as a result of selling the organization’s products/services during the reporting period.
has identifier: PI4341
notation: PI4341
had primary source: PI4341
note: Organizations should footnote all assumptions used, as well as any specific focus on stakeholders with particular disabilities.
scope note: This metric is intended to capture the total gross margin earned by, or commission paid to, individual distributors with disabilities, a measure of how organizations support the livelihoods of individuals with disabilities through their distribution chains.
defined by: giin

Students Provided Full Scholarship
type: Concept
type: Code
has name: Students Provided Full Scholarship
has description: Number of students receiving full scholarship during the reporting period.
definition: Number of students receiving full scholarship during the reporting period.
has identifier: PI4509
notation: PI4509
had primary source: PI4509
note: Organizations should footnote the details on scholarship eligibility requirements, source of scholarship funding, and other relevant details.
scope note: Full scholarships allow a student to attend school without tuition or fee payment required of the student or his/her family.
defined by: giin

Length of Transmission Lines Built or Improved
type: Concept
type: Code
has name: Length of Transmission Lines Built or Improved
has description: Length of transmission lines built or improved by the organization during the reporting period.
definition: Length of transmission lines built or improved by the organization during the reporting period.
has identifier: PI4515
notation: PI4515
had primary source: PI4515
note: Organizations should footnote all assumptions used.
scope note: This metric is intended to capture the length of transmission lines that the organization newly built or improved during the reporting period, a traditional measure of added transmission capacity. Improvements to transmission lines can include, for example, higher efficiency or greater resilience. Organizations should only report the length of transmission lines for which they have already completed construction or improvements, not any length financed but still under construction.
defined by: giin

Client Household Size
type: Concept
type: Code
has name: Client Household Size
has description: Average household size of clients of the organization during the reporting period, measured as number of individuals.
definition: Average household size of clients of the organization during the reporting period, measured as number of individuals.
has identifier: PI4548
notation: PI4548
had primary source: PI4548
note: Organizations should footnote the source used to determine average household size of clients and all other assumptions used. See usage guidance for further information.
scope note: This metric is intended to capture the average household size of clients who received the organization's products or services during the reporting period. This metric may be reported in conjunction with Client Households: Total (PI7954) and its associated submetrics. Organizations that provide products and services that are used by an entire household (such as clean cookstoves or home weatherization) might find it more appropriate to report on the number of client households served rather than the number of client individuals. By multiplying the number of Client Households by Client Household Size, organizations can estimate the number of individuals served. For example, an organization that sells products to 100 Client Households with a Client Household Size of 5 could estimate that they served 500 individuals. Organizations that rely on assumptions to report against this metric should footnote all assumptions used in the calculation. Organizations can refer to the following sources for additional information on determining client household sizes, in addition to national census information: - United Nations, Principles and Recommendations for Population and Housing Censuses (Revision 3) (https://unstats.un.org/unsd/demographic-social/Standards-and-Methods/files/Principles_and_Recommendations/Population-and-Housing-Censuses/Series_M67rev3-E.pdf) - Socio-Economic Database for Latin America and the Caribbean (http://sedlac.econo.unlp.edu.ar/eng/statistics-detalle.php?idE=36)
defined by: giin

Value of New Education Facility Materials
type: Concept
type: Code
has name: Value of New Education Facility Materials
has description: Value of new educational facility materials provided to students by the organization during the reporting period.
definition: Value of new educational facility materials provided to students by the organization during the reporting period.
has identifier: PI4554
notation: PI4554
had primary source: PI4554
note: Organizations should footnote all assumptions used, as well as details on the type of educational facility materials provided.
scope note: This metric is intended to capture the value of durable, facility-bound educational materials provided by the organization during the reporting period. Examples of educational facility materials provided, to footnote, include chairs, computers, and desks.
defined by: giin

Percent Students Receiving Free and Subsidized School Meals
type: Concept
type: Code
has name: Percent Students Receiving Free and Subsidized School Meals
has description: Percentage of students receiving free and subsidized school meals as of the end of the reporting period.
definition: Percentage of students receiving free and subsidized school meals as of the end of the reporting period.
has identifier: PI4555
notation: PI4555
had primary source: PI4555
note: Organizations should footnote all assumptions used. See usage guidance for further information.
scope note: This metric is intended to capture the percentage of students at a school receiving free or reduced-price school meals funded, not by the organization itself, but rather by a third-party institution or program (such as a government program). Therefore, the students are not considered clients receiving free products from the organization. Both full- and part-time students should be included in this calculation, if applicable, with each discrete student counted once regardless of the number of courses taken. This metric is frequently used as a proxy of poverty at the school level. For example, a financial institution that provides a loan to a school may seek to gauge the income level of the targeted stakeholders of its loan by requiring the school receiving the loan to report this metric. Organizations are also encouraged to report metrics such as School Enrollment: Poor (PI7254), School Enrollment: Very Poor (PI5583), or School Enrollment: Low Income (PI2173) if they have additional demographic details available. Organizations operating in the United States can refer to the following sources for additional information on free and reduced-price meal programs and eligibility: - New America: School Funding and Resources/Nutrition and Schools (http://atlas.newamerica.org/federal-school-nutrition-programs#toc-eligibility-and-enrollment) - USDA Food and Nutrition Service: Income Eligibility Guidelines (http://www.fns.usda.gov/school-meals/income-eligibility-guidelines) Organizations that wish to report on the number of subsidized or free school meals provided (both directly and indirectly by other organizations) can use the metric School Meals (PI6971).
defined by: giin

New Businesses Created: Total
type: Concept
type: Code
has name: New Businesses Created: Total
has description: Number of new businesses created as a result of investments made by the organization during the reporting period.
definition: Number of new businesses created as a result of investments made by the organization during the reporting period.
has identifier: PI4583
notation: PI4583
had primary source: PI4583
note: Organizations should footnote all assumptions used.
scope note: This metric is intended to capture the number of new businesses created as a result of investment, a proxy of economic activity.
defined by: giin

Protected Land Area: Total
type: Concept
type: Code
has name: Protected Land Area: Total
has description: Area of land with protected land status as of the end of the reporting period.
definition: Area of land with protected land status as of the end of the reporting period.
has identifier: PI4716
notation: PI4716
had primary source: PI4716
note: Organizations should footnote the methods applied to ensure protected land status. See usage guidance for further information.
scope note: This metric is intended to capture the number of hectares that the organization has under protected status as of the end of the reporting period, whether that protection is permanent or non-permanent. Land may be protected through legal encumbrances placed on the land or through the transfer of ownership to a qualified conservation organization. If relevant, organizations are encouraged to footnote which legal encumbrances are placed on the land and their duration, if non-permanent. Organizations are also encouraged to footnote which, and which type of qualified conservation organization owns the land or easement under conservation status.
defined by: giin

Repayment Capacity Analysis
type: Concept
type: Code
has name: Repayment Capacity Analysis
has description: Indicates whether the organization conducts repayment capacity analyses for its clients.
definition: Indicates whether the organization conducts repayment capacity analyses for its clients.
has identifier: PI4733
notation: PI4733
had primary source: PI4733
note: Organizations should footnote details on the analyses conducted. See usage guidance for further information.
scope note: This metric is intended to capture whether the organization analyzes clients’ repayment capacity. Lenders conduct repayment capacity analyses to compare a borrower's cash or income sources to a borrower's uses of credit, thereby ensuring that the borrower has sufficient sources to repay their debt. Repayment capacity analyses should be systematic and complete to ensure that lending decisions are based on an appropriate debt-to-income ratio. Organizations should disclose the financial costs to borrowers for the most representative loan product, which closely tracks the cost clients carry. They should compare these costs with those of similar products offered to similar populations by other organizations in the same country or region. Examples of practices for repayment capacity analyses, to footnote, include, among others, relying on more information than just guarantees (whether peer guarantees, co-signature, or collateral), such as household surplus; taking into consideration the possibility of additional, undisclosed debt; disseminating the organization's repayment capacity policy among employees; uniformly applying the repayment capacity policy in practice; performing analyses at each loan cycle; and visiting clients to verify information. Organizations should also note whether they restructure products/services in cases where repayment is an issue. Organizations can refer to the Smart Campaign (http://www.smartcampaign.org/storage/documents/avoidance.pdf) for further guidance on conducting repayment capacity analyses.
defined by: giin

Area of Community Facilities Financed
type: Concept
type: Code
has name: Area of Community Facilities Financed
has description: Area of community facilities projected to be constructed or preserved as a result of investments made by the organization during the reporting period.
definition: Area of community facilities projected to be constructed or preserved as a result of investments made by the organization during the reporting period.
has identifier: PI4765
notation: PI4765
had primary source: PI4765
note: Organizations should footnote all assumptions used, including what spaces they include in their calculations of area. See usage guidance for further information.
scope note: This metric is intended to capture the area within community facilities that is usable for the intended activities of that facility. For example, if a hospital does not rely on its parking lot to administer its medical services, the parking lot area would be excluded from this metric. Organizations should footnote how they calculate usable area. A community facility provides services to the local community. Examples include health and medical clinics, health-treatment facilities, schools, arts and other cultural facilities, daycare facilities (adult and youth), and community sports facilities.
defined by: giin

Jobs in Directly Supported/Financed Enterprises
type: Concept
type: Code
has name: Jobs in Directly Supported/Financed Enterprises
has description: Number of full-time equivalent employees working for enterprises financed or supported by the organization as of the end of the reporting period.
definition: Number of full-time equivalent employees working for enterprises financed or supported by the organization as of the end of the reporting period.
has identifier: PI4874
notation: PI4874
had primary source: PI4874
note: Organizations should footnote all assumptions used. See usage guidance for further information.
scope note: This metric is intended to capture jobs at all financed or directly supported enterprises as of the end of the reporting period. Organizations are encouraged to use this metric with Jobs Type (OD0660) to enable disaggregation of these data by key aspects. Organizations may choose to disclose employment by function (for example, operations and maintenance, construction, or land conservation). To align to the HIPSO (Harmonized Indicators for Private Sector Operations) indicator Direct Jobs Supported (Operations and Maintenance), organizations should include under Jobs Type (OD0660) only the options “Hiring: Jobs hired through organization itself” and “Hiring: Jobs hired/supported through third-party and directly related to operations and maintenance of company.” To align to the HIPSO indicator Construction Jobs (Temporary Construction), organizations should include only the data for Jobs Type (OD0660) options “Permanence: Temporary (One-Time)” and “Hiring: Jobs hired/supported through third-party, but not directly related to operations and maintenance of company.” The three metrics for jobs at supported/financed enterprises relate to one another, as follows. Jobs Maintained at Directly Supported/Financed Enterprises: Total (PI5691) and Jobs Created at Directly Supported/Financed Enterprises: Total (PI3687) sum to Jobs in Directly Supported/Financed Enterprises (PI4874). For example, if an investor provided a loan to a small business that had 10 employees at the time the loan was provided and 15 employees as of the end of the reporting period, Jobs Created at Directly Supported/Financed Enterprises: Total (PI3687) would be 5; Jobs in Directly Supported/Financed Enterprises (PI4874) would be 15; and Jobs Maintained at Directly Supported/Financed Enterprises: Total (PI5691) would be 10. Direct jobs in the context of this metric are defined according to the scope of the project (for instance, jobs created at a company that receives investment), following project logic and…
defined by: giin

Earnings of Distributor Individuals: Total
type: Concept
type: Code
has name: Earnings of Distributor Individuals: Total
has description: Earnings of individual distributors as a result of selling the organization’s products/services during the reporting period.
definition: Earnings of individual distributors as a result of selling the organization’s products/services during the reporting period.
has identifier: PI4881
notation: PI4881
had primary source: PI4881
note: Organizations should footnote all assumptions used.
scope note: This metric is intended to capture the total gross margin earned by, or commission paid to, individual distributors, a measure of how organizations support the livelihoods of individuals through their distribution chains. Organizations wishing to report on earnings paid to distributor organizations should instead use Earnings of Distributor Organizations: Total (PI6218) and its associated submetrics.
defined by: giin

Area of Land Reforested
type: Concept
type: Code
has name: Area of Land Reforested
has description: Area of land that the organization reforested during the reporting period.
definition: Area of land that the organization reforested during the reporting period.
has identifier: PI4907
notation: PI4907
had primary source: PI4907
note: Organizations should footnote all assumptions used.
scope note: This metric is intended to capture the area of land reforested, a proxy for the efficiency of management measures, natural regeneration, and the magnitude of effects of the reforested area on surrounding areas. Analysis of area reforested often suggests needed management adjustments as a result of biotic and abiotic factors such as diseases and droughts. Organizations are encouraged to closely monitor deforestation and its causes through remote sensing data, tracking the evolution and speed of reforestation over time.
defined by: giin

Student Promotion Rate
type: Concept
type: Code
has name: Student Promotion Rate
has description: Percentage of students advancing from one grade of schooling to the next during the reporting period.
definition: Percentage of students advancing from one grade of schooling to the next during the reporting period.
has identifier: PI4924
notation: PI4924
had primary source: PI4924
note: Organizations should footnote all assumptions used, as well as any relevant details regarding the promotion rate.
scope note: This metric is intended to capture the percentage of students that have continued from one grade to the next—for example, from the third to the fourth year of secondary school. For instance, if 100 students had completed their third year of secondary school as of the end of the previous reporting period and 95 have continued to the fourth year of secondary school as of the beginning of the reporting period, the student promotion rate is 95%, calculated as 95/100 × 100. This metric differs from Student Dropout Rate (PI9910), which captures the rate at which students drop out during the reporting period. This metric aligns with the UNESCO Institute for Statistics Indicator “Promotion Rate by Grade (PR)” (http://uis.unesco.org/sites/default/files/documents/education-indicators-technical-guidelines-en_0.pdf). This metric can be used as an input to calculate “Transition Rate” between schooling levels (for example, from primary to secondary school) This metric is multi-dimensional with regard to the five dimensions of impact. In some contexts, this metric can serve as an indicator of whether the outcome being sought by an investor or organization is occurring (the WHAT dimension of impact). It may also help measure the HOW MUCH Scale dimension, which helps estimate the number of the targeted stakeholders experiencing the outcome. For more on the alignment of IRIS metrics to the five dimensions of impact, see IRIS+ and the Five Dimensions of Impact (https://iris.thegiin.org/document/iris-and-the-five-dimensions/). No single metric is sufficient to understand an impact; rather, metrics are selected as a set across all dimensions of impact. When possible, the selection of metrics to measure and describe the five dimensions should be based on best practice and evidence.
defined by: giin

Client Organizations: SME
type: Concept
type: Code
has name: Client Organizations: SME
has description: Number of small to medium-sized enterprises (SMEs) that were clients of the organization during the reporting period.
definition: Number of small to medium-sized enterprises (SMEs) that were clients of the organization during the reporting period.
has identifier: PI4940
notation: PI4940
had primary source: PI4940
note: Organizations should footnote all assumptions used, including source of data. Organizations should also footnote the types of enterprises that were clients, using Client Type (PD7993).
scope note: This metric is intended to capture the number of unique client small- and medium-sized enterprises (SMEs) of the reporting organization during the reporting period. The IFC defines an SME as one that meets two of the following three criteria: 300 employees or fewer, USD 15 million in assets or less, or annual sales of USD 15 million or less. See “IFC Definition of Targeted Sectors” (https://www.ifc.org/wps/wcm/connect/industry_ext_content/ifc_external_corporate_site/financial+institutions/priorities/ifcs+definitions+of+targeted+sectors). Organizations should reference the definition of Small and Medium Enterprises (SMEs) for further detail. This metric is multi-dimensional with regard to the five dimensions of impact. It may help describe the WHO dimension when the stakeholder group represented by the metric is the stakeholder group targeted by the investment or organization. It may also help measure the HOW MUCH Scale dimension, which helps estimate the number of the targeted stakeholders experiencing the outcome. For more on the alignment of IRIS metrics to the five dimensions of impact, see IRIS+ and the Five Dimensions of Impact (https://iris.thegiin.org/document/iris-and-the-five-dimensions/). No single metric is sufficient to understand an impact; rather, metrics are selected as a set across all dimensions of impact. When possible, the selection of metrics to measure and describe the five dimensions should be based on best practice and evidence.
defined by: giin

Units/Volume Purchased from Supplier Individuals: Smallholder
type: Concept
type: Code
has name: Units/Volume Purchased from Supplier Individuals: Smallholder
has description: Units/volume purchased from smallholder farmers who sold to the reporting organization during the reporting period.
definition: Units/volume purchased from smallholder farmers who sold to the reporting organization during the reporting period.
has identifier: PI4982
notation: PI4982
had primary source: PI4982
note: Organizations should footnote all assumptions used, including source of data.
scope note: This metric is intended to capture the total units or volume an organization purchased during the reporting period from individual smallholders. Organizations that purchase different types of products/services should consider reporting separately against each different type of product/service. Organizations may wish to use this metric in conjunction with Supplier Individuals: Smallholder (PI9991).
defined by: giin

Patients Completing Treatment
type: Concept
type: Code
has name: Patients Completing Treatment
has description: Number of patients who successfully completed the clinically recommended course of a health intervention during the reporting period.
definition: Number of patients who successfully completed the clinically recommended course of a health intervention during the reporting period.
has identifier: PI5060
notation: PI5060
had primary source: PI5060
note: Organizations should footnote the expected time frame and clinical protocols that define a completed treatment, in addition to all other assumptions used. See usage guidance for further information.
scope note: This metric is intended to capture the number of patients who successfully completed treatment during the reporting period. Successful completion means that all required steps were completed and taken in the appropriate time frame and that the treatment adhered to local protocols. Examples of interventions in which this metric might apply include: - Number of pregnant patients who attended all required antenatal care visits during the reporting period. - Number of patients who completed all required counseling visits during the reporting period.
defined by: giin

Number of Equity Investments Closed
type: Concept
type: Code
has name: Number of Equity Investments Closed
has description: Number of equity investments closed by the organization during the reporting period.
definition: Number of equity investments closed by the organization during the reporting period.
has identifier: PI5066
notation: PI5066
had primary source: PI5066
note: Organizations should footnote all assumptions used. See usage guidance for further information.
scope note: This metric is intended to capture the number of equity investments completed during the reporting period and not the number of investments exited. In an equity investment, in exchange for investment funds, the organization receives an ownership interest in the equity (stock) of the enterprise, either common or preferred stock. Organizations are encouraged to footnote whether their equity is held directly in enterprises or through funds.
defined by: giin

Student to Teacher Ratio
type: Concept
type: Code
has name: Student to Teacher Ratio
has description: Number of students per teacher during the reporting period.
definition: Number of students per teacher during the reporting period.
has identifier: PI5110
notation: PI5110
had primary source: PI5110
note: Organizations should footnote all assumptions used.
scope note: This metric is intended to capture the ratio of students to teachers during the reporting period, often used as a proxy of teacher workload, educational investment, or instructional efficiency. In some contexts, this metric can serve as an indicator of whether the outcome being sought by an investor or organization is occurring (the WHAT dimension of impact). For more on the alignment of IRIS metrics to the five dimensions of impact, see IRIS+ and the Five Dimensions of Impact (https://iris.thegiin.org/document/iris-and-the-five-dimensions/). No single metric is sufficient to understand an impact; rather, metrics are selected as a set across all dimensions of impact. When possible, the selection of metrics to measure and describe the five dimensions should be based on best practice and evidence.
defined by: giin

Average Loan Size Disbursed
type: Concept
type: Code
has name: Average Loan Size Disbursed
has description: Average loan size disbursed by the organization during the reporting period.
definition: Average loan size disbursed by the organization during the reporting period.
has identifier: PI5160
notation: PI5160
had primary source: PI5160
note: Organizations should footnote all assumptions used.
scope note: This metric is intended to capture the average loan size disbursed by the organization during the reporting period and may be calculated from aggregate data: Value of Loans Disbursed (PI5476) and Number of Loans Disbursed (PI8381).
defined by: giin

Client Transactions
type: Concept
type: Code
has name: Client Transactions
has description: Number of sales or client transactions during the reporting period.
definition: Number of sales or client transactions during the reporting period.
has identifier: PI5184
notation: PI5184
had primary source: PI5184
note: Organizations should footnote all assumptions used, including source of data.
scope note: This metric is intended to capture the number of total transactions with clients during the reporting period, which can include repeat sales per unique client. A client transaction represents an exchange between a client and the organization that results in the purchase or acquisition of the organization's product(s)/service(s). One transaction can include the purchase of multiple units. This metric is different from Client Individuals: Total (PI4060) and related submetrics, which are intended to capture the number of unique individuals who are clients of the organization during the reporting period. In specific contexts, and based on evidence, this metric may serve as a proxy indicator of whether the outcome being sought by an investor or organization is occurring (the WHAT dimension of impact). For more on the alignment of IRIS metrics to the five dimensions of impact, see IRIS+ and the Five Dimensions of Impact (https://iris.thegiin.org/document/iris-and-the-five-dimensions/). No single metric is sufficient to understand an impact; rather, metrics are selected as a set across all dimensions of impact. When possible, the selection of metrics to measure and describe the five dimensions should be based on best practice and evidence.
defined by: giin

Energy Transmitted: Total
type: Concept
type: Code
has name: Energy Transmitted: Total
has description: Amount of energy transmitted by the organization during the reporting period (in MWh).
definition: Amount of energy transmitted by the organization during the reporting period (in MWh).
has identifier: PI5193
notation: PI5193
had primary source: PI5193
note: Organizations should footnote all assumptions used.
scope note: This metric is intended to capture the total amount of energy transmitted (including from renewable and non-renewable sources) by the organization during the reporting period. To disaggregate this metric by energy type—such as renewable vs. non-renewable—report this metric disaggregated by the relevant options in Primary Energy Source (OI3781).
defined by: giin

Complaints Ratio
type: Concept
type: Code
has name: Complaints Ratio
has description: Number of complaints registered per client of the reporting organization during the reporting period.
definition: Number of complaints registered per client of the reporting organization during the reporting period.
has identifier: PI5216
notation: PI5216
had primary source: PI5216
note: Organizations should footnote all assumptions used.
scope note: This metric is intended to capture the number of complaints per client of the organization during the reporting period. Organizations reporting this metric should have a complaint tracking system in place. While there are different modes for processing complaints, this metric should capture all modes of client recourse. Organizations are encouraged to report this metric in conjunction with Client Complaint Tracking System (PI9435). For more detail on the ratio and for guidance on its interpretation for organizations providing microinsurance, see the Microinsurance Network's Social Performance Indicators for Microinsurance, p. 27 (https://www.social-protection.org/gimi/ShowRessource.action?id=5270/).
defined by: giin

Client Individuals: Forcibly Displaced
type: Concept
type: Code
has name: Client Individuals: Forcibly Displaced
has description: Number of unique individuals who were forcibly displaced and were clients of the organization during the reporting period.
definition: Number of unique individuals who were forcibly displaced and were clients of the organization during the reporting period.
has identifier: PI5297
notation: PI5297
had primary source: PI5297
note: Organizations should footnote all assumptions used, including their categorization of forcibly displaced individuals served. See usage guidance for further information.
scope note: This metric is intended to capture the number of individuals served by the organization who have been forcibly displaced, including refugees, asylum seekers, internally displaced persons, stateless persons, and returnees. For more information on forcible displacement, see the United Nations’ World Refugee Day website (https://www.un.org/en/events/refugeeday/background.shtml) and the World Health Organization’s displaced people summary (https://www.who.int/environmental_health_emergencies/displaced_people/en/). This metric may help describe the HOW MUCH Scale dimension, which helps estimate the number of the targeted stakeholders experiencing the outcome. For more on the alignment of IRIS metrics to the five dimensions of impact, see IRIS+ and the Five Dimensions of Impact (https://iris.thegiin.org/document/iris-and-the-five-dimensions/). No single metric is sufficient to understand an impact; rather, metrics are selected as a set across all dimensions of impact. When possible, the selection of metrics to measure and describe the five dimensions should be based on best practice and evidence.
defined by: giin

Supplier Individuals: Total
type: Concept
type: Code
has name: Supplier Individuals: Total
has description: Number of individuals who sold goods or services to the organization during the reporting period.
definition: Number of individuals who sold goods or services to the organization during the reporting period.
has identifier: PI5350
notation: PI5350
had primary source: PI5350
note: Organizations should footnote all assumptions used.
scope note: This metric is intended to capture how organizations support livelihoods through their supply chains. Organizations wishing to report on supplier organizations should instead use Supplier Organizations: Total (PI9566) and its associated submetrics. This metric may help describe the HOW MUCH Scale dimension, which helps estimate the number of the targeted stakeholders experiencing the outcome. For more on the alignment of IRIS metrics to the five dimensions of impact, see IRIS+ and the Five Dimensions of Impact (https://iris.thegiin.org/document/iris-and-the-five-dimensions/). No single metric is sufficient to understand an impact; rather, metrics are selected as a set across all dimensions of impact. When possible, the selection of metrics to measure and describe the five dimensions should be based on best practice and evidence.
defined by: giin

Individuals Trained: Advisory Services
type: Concept
type: Code
has name: Individuals Trained: Advisory Services
has description: Number of individuals who received one-on-one advisory services (sometimes called technical assistance) from the organization during the reporting period.
definition: Number of individuals who received one-on-one advisory services (sometimes called technical assistance) from the organization during the reporting period.
has identifier: PI5352
notation: PI5352
had primary source: PI5352
note: Organizations should footnote the type and extent of the provided services, as well as who received the training. See usage guidance for further information.
scope note: This metric is intended to capture the number of individuals who received one-on-one advisory services or technical assistance provided by the organization. Advisory services may or may not be restricted to clients of the organization. This metric may apply to organizations operating in microfinance or agriculture, among other sectors, that provide advisory services to clients and other community members. Examples of advisory services to footnote could include skills training, consulting services (such as process implementation), and staffing. Advisory services may be fee-based or provided for free. This metric may help describe the HOW MUCH Scale dimension, which helps estimate the number of the targeted stakeholders experiencing the outcome. For more on the alignment of IRIS metrics to the five dimensions of impact, see IRIS+ and the Five Dimensions of Impact (https://iris.thegiin.org/document/iris-and-the-five-dimensions/). No single metric is sufficient to understand an impact; rather, metrics are selected as a set across all dimensions of impact. When possible, the selection of metrics to measure and describe the five dimensions should be based on best practice and evidence.
defined by: giin

Greenhouse Gas Reductions due to Products Sold
type: Concept
type: Code
has name: Greenhouse Gas Reductions due to Products Sold
has description: Amount of reductions in greenhouse gas (GHG) emissions over the lifetimes of products sold during the reporting period.
definition: Amount of reductions in greenhouse gas (GHG) emissions over the lifetimes of products sold during the reporting period.
has identifier: PI5376
notation: PI5376
had primary source: PI5376
note: Organizations should footnote all assumptions used.
scope note: This metric is intended to capture the GHG emissions reduced or mitigated as a result of products the organization sold during the reporting period. The product-lifetime reduction in GHG emissions is calculated by subtracting Greenhouse Gas Emissions of Product (PD9427) from Greenhouse Gas Emissions of Product Replaced (PD2243). This is then multiplied by the units/volume sold per product to get the total GHG reductions over the lifetime of the product(s). These GHG reductions are then summed across all products sold during the reporting period. When multiplying GHG reductions from each product sold by Units/Volume Sold: Total (PI1263), organizations should, under Units/Volume Sold: Total (PI1263), use the absolute number of product units sold rather than the volume of GHG reductions delivered by the product. The Greenhouse Gas Protocol (GHG Protocol) is the most widely used international accounting tool to understand, quantify, and manage greenhouse gas emissions. For more information on the GHG Protocol, organizations should refer to the following: - Greenhouse Gas Protocol Standards (http://www.ghgprotocol.org/standards) - Greenhouse Gas Protocol Calculators (https://ghgprotocol.org/calculation-tools) This metric is multi-dimensional with regard to the five dimensions of impact. In specific contexts, and based on evidence, this metric may serve as a proxy indicator of whether the outcome being sought by an investor or organization is occurring (the WHAT dimension of impact). It may also help measure the HOW MUCH Depth dimension of impact, which helps estimate the degree of change in outcome that the stakeholders experienced. For more on the alignment of IRIS metrics to the five dimensions of impact, see IRIS+ and the Five Dimensions of Impact (https://iris.thegiin.org/document/iris-and-the-five-dimensions/). No single metric is sufficient to understand an impact; rather, metrics are selected as a set across all dimensions of impact. When possible, the selection o…
defined by: giin

Classroom Area per Student
type: Concept
type: Code
has name: Classroom Area per Student
has description: Area of classroom space per student during the reporting period.
definition: Area of classroom space per student during the reporting period.
has identifier: PI5380
notation: PI5380
had primary source: PI5380
note: Organizations should footnote all assumptions used.
scope note: This metric is intended to capture the amount of classroom space the organization provides each student. Organizations are encouraged to align with state and international standards. For example, the New York State Department of Health Bureau of Emergency Medical Services published “Classroom Design Standards” that detail the required floor area per student, categorized by the classroom setup style.
defined by: giin

Earnings of Distributor Individuals: Very Poor
type: Concept
type: Code
has name: Earnings of Distributor Individuals: Very Poor
has description: Earnings of very poor individual distributors as a result of selling the organization’s products/services during the reporting period.
definition: Earnings of very poor individual distributors as a result of selling the organization’s products/services during the reporting period.
has identifier: PI5391
notation: PI5391
had primary source: PI5391
note: Organizations should footnote all assumptions used, including details on the assessment tools used to identify the poverty level of distributors. See usage guidance for further information.
scope note: This metric is intended to capture the total gross margin earned by, or commission paid to, individual very poor distributors, a measure of how organizations support the livelihoods of individuals living in poverty through their distribution chains. Because assessing the poverty level of stakeholders is complex, organizations will likely have to use specific assessment tools to accurately report on this metric. See the glossary definition for additional information on commonly used tools to help determine the absolute poverty level of individuals and households.
defined by: giin

Units/Volume Purchased from Supplier Organizations: SME
type: Concept
type: Code
has name: Units/Volume Purchased from Supplier Organizations: SME
has description: Units/volume from small- to medium-sized enterprises (SMEs) that sold to the reporting organization during the reporting period.
definition: Units/volume from small- to medium-sized enterprises (SMEs) that sold to the reporting organization during the reporting period.
has identifier: PI5473
notation: PI5473
had primary source: PI5473
note: Organizations should footnote all assumptions used, including source of data.
scope note: This metric is intended to capture the total units or volume an organization purchased during the reporting period from suppliers that are small- to medium-sized enterprises (SMEs). Organizations that purchase different types of products/services should consider reporting separately against each different type of product/service. Organizations may wish to use this metric in conjunction with Supplier Organizations: SME (PI9495). For a definition of SMEs, see the IRIS+ Glossary.
defined by: giin

Value of Loans Disbursed
type: Concept
type: Code
has name: Value of Loans Disbursed
has description: Value of loans disbursed by the organization during the reporting period.
definition: Value of loans disbursed by the organization during the reporting period.
has identifier: PI5476
notation: PI5476
had primary source: PI5476
note: Organizations should footnote all assumptions used.
scope note: This metric is intended to capture the total value disbursed as loans by the organization during the reporting period.
defined by: giin

Payments to Supplier Organizations: Total
type: Concept
type: Code
has name: Payments to Supplier Organizations: Total
has description: Value of payments made to enterprises that sold goods or services to the organization during the reporting period.
definition: Value of payments made to enterprises that sold goods or services to the organization during the reporting period.
has identifier: PI5478
notation: PI5478
had primary source: PI5478
note: Organizations should footnote all assumptions used.
scope note: This metric is intended to capture information about the enterprises that supply goods or services to the reporting organization. Organizations can themselves determine the precise threshold at which they report suppliers. In most cases, organizations should include only those enterprises supplying goods and services that are fundamental to the operations of the reporting organization. Organizations should not include subcontractors as part of this metric; subcontractors can be reported under Temporary Employees (OI9028) and its related submetrics.
defined by: giin

Target Stakeholder Spending: Energy
type: Concept
type: Code
has name: Target Stakeholder Spending: Energy
has description: Amount of money spent by the average target stakeholder on sources of energy during the reporting period.
definition: Amount of money spent by the average target stakeholder on sources of energy during the reporting period.
has identifier: PI5489
notation: PI5489
had primary source: PI5489
note: Organizations should footnote the type of expenditures made, as well as details of energy sources used. Organizations should also footnote all other assumptions used, including source of data.
scope note: This metric is intended to capture target stakeholder spending on energy, including fuels, charging stations, and product payments, among other costs. These data can be collected directly from target stakeholders through a survey. Organizations should footnote details on the sample size and survey instrument used, as well as details on who administered the survey and who aggregated the resulting data. In specific contexts, and based on evidence, this metric may serve as a proxy indicator of whether the outcome being sought by an investor or organization is occurring (the WHAT dimension of impact). For more on the alignment of IRIS metrics to the five dimensions of impact, see IRIS+ and the Five Dimensions of Impact (https://iris.thegiin.org/document/iris-and-the-five-dimensions/). No single metric is sufficient to understand an impact; rather, metrics are selected as a set across all dimensions of impact. When possible, the selection of metrics to measure and describe the five dimensions should be based on best practice and evidence.
defined by: giin

Student to Classroom Ratio
type: Concept
type: Code
has name: Student to Classroom Ratio
has description: Number of students per classroom during the reporting period.
definition: Number of students per classroom during the reporting period.
has identifier: PI5501
notation: PI5501
had primary source: PI5501
note: Organizations should footnote all assumptions used.
scope note: This metric is intended to capture the number of students per physical classroom at the organization during the reporting period. This metric is multi-dimensional with regard to the five dimensions of impact. It may help describe the WHO dimension when the stakeholder group represented by the metric is the stakeholder group targeted by the investment or organization. It may also help measure the HOW MUCH Scale dimension, which helps estimate the number of the targeted stakeholders experiencing the outcome. For more on the alignment of IRIS metrics to the five dimensions of impact, see IRIS+ and the Five Dimensions of Impact (https://iris.thegiin.org/document/iris-and-the-five-dimensions/). No single metric is sufficient to understand an impact; rather, metrics are selected as a set across all dimensions of impact. When possible, the selection of metrics to measure and describe the five dimensions should be based on best practice and evidence.
defined by: giin

Client Organizations Led: Total
type: Concept
type: Code
has name: Client Organizations Led: Total
has description: Number of client organizations as of the end of the reporting period in which the leader (or half or more of the leaders, if there are multiple) represents a specific group (for example, women or historically marginalized groups).
definition: Number of client organizations as of the end of the reporting period in which the leader (or half or more of the leaders, if there are multiple) represents a specific group (for example, women or historically marginalized groups).
has identifier: PI5576
notation: PI5576
had primary source: PI5576
note: Organizations should footnote all assumptions used.
scope note: This metric, used in combination with Target Stakeholder Demographic (PD5752), is intended to capture the number of client organizations that are led by persons of specific groups. For example, this metric can support calculations of the percentage of a portfolio invested in companies led by women or by individuals from groups historically marginalized due to race and/or ethnicity. Leader(s) counted must retain an active role in the organization as of the end of the reporting period. An active role may include acting in an advisory capacity for key decisions and does not necessarily require a full-time role at the organization. Typically, this metric refers to the CEO of the company. If the company is led by multiple people, at least 51% of the leaders must be from the specified group in order to be considered "led" by that group. Organizations focusing this metric on groups historically marginalized due to race and/or ethnicity must define that group according to context. For example, in the United States, organizations might focus on Black, Indigenous, and People of Color (BIPOC). In South Africa, organizations might focus on Black African, Coloured, and Indian or Asian Individuals. In all contexts, when defining these groups, organizations must consider local history and context. These data can often be collected from the human resources department, though for accuracy organizations should ensure that data on racial and ethnic background are self-reported. Used along with Target Stakeholder Demographic (PD5752) to specify historically marginalized groups due to race and/or ethnicity, this metric aligns with the Corporate Racial Equity Alliance’s (https://corporateracialequityalliance.org/) Investor Blueprint for Racial Equity and its corporate-focused CEO Blueprint for Racial Equity (https://corporateracialequityalliance.org/2021-blueprint).
defined by: giin

School Enrollment: Very Poor
type: Concept
type: Code
has name: School Enrollment: Very Poor
has description: Number of very poor students enrolled as of the end of the reporting period, both full- and part-time, with each discrete student counted once regardless of their number of courses.
definition: Number of very poor students enrolled as of the end of the reporting period, both full- and part-time, with each discrete student counted once regardless of their number of courses.
has identifier: PI5583
notation: PI5583
had primary source: PI5583
note: Organizations should footnote all assumptions used, including details on the assessment tools used to identify the poverty level of students. Organizations should also breakdown enrolled students into full- and part-time. See usage guidance for further information.
scope note: This metric is intended to capture the number of students from very poor backgrounds who are enrolled at the school as of the end of the reporting period, including both full- and part-time students. Each discrete student should be counted once, regardless of number of courses taken. These data may be most effectively collected through either school reporting (for private schools) or government reporting (for public schools). Because assessing the poverty level of stakeholders is complex, organizations will likely have to use specific assessment tools to accurately report on this metric. See the glossary definition for additional information on commonly used tools to help determine the absolute poverty level of individuals and households. This metric is multi-dimensional with regard to the five dimensions of impact. It may help describe the WHO dimension when the stakeholder group represented by the metric is the stakeholder group targeted by the investment or organization. It may also help measure the HOW MUCH Scale dimension, which helps estimate the number of the targeted stakeholders experiencing the outcome. For more on the alignment of IRIS metrics to the five dimensions of impact, see IRIS+ and the Five Dimensions of Impact (https://iris.thegiin.org/document/iris-and-the-five-dimensions/). No single metric is sufficient to understand an impact; rather, metrics are selected as a set across all dimensions of impact. When possible, the selection of metrics to measure and describe the five dimensions should be based on best practice and evidence.
defined by: giin

Length of Road Built or Improved
type: Concept
type: Code
has name: Length of Road Built or Improved
has description: Length of road built or improved by the organization during the reporting period.
definition: Length of road built or improved by the organization during the reporting period.
has identifier: PI5587
notation: PI5587
had primary source: PI5587
note: Organizations should footnote all assumptions used, including source of data.
scope note: This metric is intended to capture the length of road (urban or non-urban) that was newly built or improved during the reporting period. Improvements to roads can include repaving, adding lanes for cars, or adding access for bikes and other non-motorized transport, among other improvements. This metric is often used by International Finance Institutions (IFIs) as part of transportation analysis. HIPSO (Harmonized Indicators for Private Sector Operations) users should disaggregate from this metric the length of road that increases access to the network for non-motorized forms of transport. Organizations should only report the length of road for which construction has already been completed, not that financed and still under construction.
defined by: giin

Waste Reductions from Services Sold
type: Concept
type: Code
has name: Waste Reductions from Services Sold
has description: Amount of waste reduced during the reporting period as a result of the organization's services.
definition: Amount of waste reduced during the reporting period as a result of the organization's services.
has identifier: PI5678
notation: PI5678
had primary source: PI5678
note: Organizations should footnote all assumptions used. See usage guidance for further information.
scope note: This metric is intended to capture waste reductions that result from services the organization delivers. For example, an auto parts aftermarket recycler might report waste avoided as a result of recycling used auto parts. Such waste reduction might include efforts to reduce (i.e., using fewer inputs), reuse (e.g., repurposing rather than disposing or recycling excess inputs or unwanted outputs), or recycle (e.g., through established systems or through on-site processing) materials or energy through the services provided by the organization. Organizations wishing to report waste reductions achieved through their operations should report Waste Reduced (OI7920). Organizations wishing to report on waste reductions achieved through the production and sale of products should report Waste Reductions from Products Sold (PI5926). In some contexts, this metric may help measure the HOW MUCH Depth dimension of impact, which helps estimate the degree of change in outcome that the stakeholders experienced. For more on the alignment of IRIS metrics to the five dimensions of impact, see IRIS+ and the Five Dimensions of Impact (https://iris.thegiin.org/document/iris-and-the-five-dimensions/). No single metric is sufficient to understand an impact; rather, metrics are selected as a set across all dimensions of impact. When possible, the selection of metrics to measure and describe the five dimensions should be based on best practice and evidence.
defined by: giin

Service Hours Provided
type: Concept
type: Code
has name: Service Hours Provided
has description: Number of hours of service provided during the reporting period.
definition: Number of hours of service provided during the reporting period.
has identifier: PI5683
notation: PI5683
had primary source: PI5683
note: Organizations should footnote all assumptions used.
scope note: This metric is intended to capture the amount of time a service—for example, hours of electricity, running water, or internet service—is provided to clients during the reporting period. Organizations may use Product/Service Detailed Type (PD1516) to describe or disaggregate this metric by services provided. By comparing this metric to the total duration of the reporting period, organizations can estimate the quality of services provided. Organizations are encouraged to use this metric in combination with Service Hours Interrupted (PI2230) to capture service outage rates. For water, sanitation, and hygiene (WASH investments), this metric is intended to capture how many hours of water are available as a result of the products or services provided by the organization. This metric is not designed to cover water provided over the lifetime of a product or service but rather only includes those hours of water made available during the reporting period. This metric is aligned to the IBNET indicator 15.1, “Continuity of Service." The IBNET reporting format is average hours / day. These are administrative data and should come from the service provider. This metric may help describe the HOW MUCH Scale dimension, which helps estimate the number of the targeted stakeholders experiencing the outcome. For more on the alignment of IRIS metrics to the five dimensions of impact, see IRIS+ and the Five Dimensions of Impact (https://iris.thegiin.org/document/iris-and-the-five-dimensions/). No single metric is sufficient to understand an impact; rather, metrics are selected as a set across all dimensions of impact. The selection of metrics to measure and describe the five dimensions should be based on best practice and evidence.
defined by: giin

Jobs Maintained at Directly Supported/Financed Enterprises: Total
type: Concept
type: Code
has name: Jobs Maintained at Directly Supported/Financed Enterprises: Total
has description: Number of full-time equivalent employees working for enterprises financed or supported by the organization as of the end of the reporting period.
definition: Number of full-time equivalent employees working for enterprises financed or supported by the organization as of the end of the reporting period.
has identifier: PI5691
notation: PI5691
had primary source: PI5691
note: Organizations should footnote all assumptions used. Organizations that report data for more than one reporting period should be careful to very clearly footnote which they are using for this metric. See usage guidance for further information.
scope note: This metric is intended to capture jobs maintained during the reporting period at directly supported or financed enterprises. Organizations should measure the number of maintained full-time equivalent positions at the organization, regardless of the number of unique individuals employed or the positions they held. For example, if a full-time equivalent employee resigns and the position is filled, this position should count as just one full-time equivalent job maintained, and none created. Organizations are encouraged to use this metric with Jobs Type (OD0660) to enable disaggregation of these data by key aspects. Organizations may choose to disclose employment by function (for example, operations and maintenance, construction, or land conservation). The three metrics for jobs at supported/financed enterprises relate to one another, as follows. Jobs Maintained at Directly Supported/Financed Enterprises: Total (PI5691) and Jobs Created at Directly Supported/Financed Enterprises: Total (PI3687) sum to Jobs in Directly Supported/Financed Enterprises (PI4874). For example, if an investor provided a loan to a small business that had 10 employees at the time the loan was provided and 15 employees as of the end of the reporting period, Jobs Created at Directly Supported/Financed Enterprises: Total (PI3687) would be 5; Jobs in Directly Supported/Financed Enterprises (PI4874) would be 15; and Jobs Maintained at Directly Supported/Financed Enterprises: Total (PI5691) would be 10. Direct jobs in the context of this metric are defined according to the scope of the project (for instance, jobs created at a company that receives investment), following project logic and objectives. For some types of financial intermediaries, organizations should footnote a clear definition of direct jobs. For instance, if measured using a capacity-building approach, direct jobs supported are identified at the direct, operational level. If defined using an economic impact approach, direct jobs suppor…
defined by: giin

Value of New Education Instructional Materials
type: Concept
type: Code
has name: Value of New Education Instructional Materials
has description: Value of new educational instructional materials provided to students by the organization during the reporting period.
definition: Value of new educational instructional materials provided to students by the organization during the reporting period.
has identifier: PI5736
notation: PI5736
had primary source: PI5736
note: Organizations should footnote all assumptions used, as well as details on the type of education instruction materials provided.
scope note: This metric is intended to capture the value of instructional materials provided by the organization during the reporting period. Examples of educational instructional materials, to footnote, include textbooks, notebooks, and writing implements.
defined by: giin

Critical Equipment/Facility Utilization Rate
type: Concept
type: Code
has name: Critical Equipment/Facility Utilization Rate
has description: Utilization rate of an identified critical piece of equipment or facility during the reporting period.
definition: Utilization rate of an identified critical piece of equipment or facility during the reporting period.
has identifier: PI5743
notation: PI5743
had primary source: PI5743
note: Organizations should footnote the specific critical equipment or facility, as well as all assumptions used. See usage guidance for further information.
scope note: This metric is intended to capture the ratio of time when the machine or facility was actually available compared to the expected availability during the reporting period. Expected availability should not be reduced for times during which the equipment or facility was broken or not in use due to electricity shortages, for instance. Organizations should report this metric separately for each equipment and facility. Patient bed occupancy rate is a common usage example for organizations operating in health care.
defined by: giin

Area of Adjacent Protected Land
type: Concept
type: Code
has name: Area of Adjacent Protected Land
has description: Area of protected land that shares a boundary with the organization's protected land as of the end of the reporting period.
definition: Area of protected land that shares a boundary with the organization's protected land as of the end of the reporting period.
has identifier: PI5750
notation: PI5750
had primary source: PI5750
note: Organizations should footnote all assumptions used. See usage guidance for further information.
scope note: This metric is intended to capture protected land assemblage, the area of protected land not controlled by the organization but adjacent to land controlled by the reporting organization. Organizations should report all land area controlled by other entities that forms a contiguous assemblage with protected land area directly or indirectly controlled by the reporting organization. For many conservation objectives, large, connected areas of conserved land are more valuable than small, disconnected pieces of conserved land. This metric helps capture holistically how a specific project complements previous conservation work. Adjacent land that is also subject to conservation measures maximizes the impact of conservation measures in newly protected areas. Potential adverse effects of adjacent land use, which organizations can footnote, may extend into the protected area. On the other hand, the transition area (ecotone) between the protected area and adjacent land can provide edge habitats that support rich biodiversity. Remote sensing data or field visits can capture the area and land use of adjacent parcels, including details on their extent, vegetation, species, and relief, which can help optimize management in controlled area. Organizations may footnote whether neighboring land is under deliberate management, has future plans for conversation or use, or has owner(s) with potential interest in cooperating on conservation management.
defined by: giin

Percent Baggage Damaged or Lost
type: Concept
type: Code
has name: Percent Baggage Damaged or Lost
has description: Percentage of baggage handled by the organization that is damaged, or that has contents damaged or lost, during the reporting period.
definition: Percentage of baggage handled by the organization that is damaged, or that has contents damaged or lost, during the reporting period.
has identifier: PI5776
notation: PI5776
had primary source: PI5776
note: Organizations should footnote all assumptions used.
scope note: This metric is intended to capture the percentage of client luggage handled by the organization during the reporting period that was damaged, delayed, or lost while out of the client’s (passenger's) care. Baggage damaged and lost is an indicator of quality of service provided. This metric is often used by International Finance Institutions (IFIs) as part of transportation analysis.
defined by: giin

Length of Coastline Present
type: Concept
type: Code
has name: Length of Coastline Present
has description: Length of marine or freshwater coastline present during the reporting period on protected land, land under sustainable stewardship, or land under sustainable cultivation.
definition: Length of marine or freshwater coastline present during the reporting period on protected land, land under sustainable stewardship, or land under sustainable cultivation.
has identifier: PI5840
notation: PI5840
had primary source: PI5840
note: Organizations should footnote all assumptions used.
scope note: This metric is intended to capture the length of coastline the organization is working to protect. Organizations are encouraged to report this metric in conjunction with Land Directly Controlled: Sustainably Managed (OI6912), Land Indirectly Controlled: Sustainably Managed (PI6796), and Protected Land Area (PI4716).
defined by: giin

Energy Generated for Sale: Renewable
type: Concept
type: Code
has name: Energy Generated for Sale: Renewable
has description: Amount of renewable energy generated and sold to offtaker(s) during the reporting period.
definition: Amount of renewable energy generated and sold to offtaker(s) during the reporting period.
has identifier: PI5842
notation: PI5842
had primary source: PI5842
note: Organizations should footnote the renewable energy type(s) and all assumptions used.
scope note: NOTE: This metric will be deprecated in a forthcoming update to the IRIS Catalog of Metrics. Users are advised to instead report Energy Generated for Sale: Total (PI8706), disaggregated by Primary Energy Source (OI3781), all options under Renewable. This metric is intended to capture renewable energy generated for commercial sale by the organization. Bulk energy is usually sold under a power purchase agreement with an electricity utility. The buyer or purchaser of this energy is termed the offtaker. Renewable energy sources include solar, wind, geothermal, hydro energy, and biomass, among other forms. Organizations can refer to the glossary for additional information. Large-scale hydropower is often excluded from the definition of renewable energy. Although water itself is a renewable resource, the natural ecology of rivers is not, and hydroelectric dams can adversely affect aquatic ecosystems. Organizations can refer to the Low Impact Hydropower Institute (http://lowimpacthydro.org) for further guidance on creating low-impact hydropower operations. Organizations wishing to report on the amount of renewable energy generated for the organization's own use should instead report Energy Generated for Use: Renewable (OI2496). In some contexts, this metric can serve as an indicator of whether the outcome being sought by an investor or organization is occurring (the WHAT dimension of impact). For more on the alignment of IRIS metrics to the five dimensions of impact, see IRIS+ and the Five Dimensions of Impact (https://iris.thegiin.org/document/iris-and-the-five-dimensions/). No single metric is sufficient to understand an impact; rather, metrics are selected as a set across all dimensions of impact. When possible, the selection of metrics to measure and describe the five dimensions should be based on best practice and evidence.
defined by: giin

Sales Revenue: Exports
type: Concept
type: Code
has name: Sales Revenue: Exports
has description: Value of the revenue from sales of exports of the product/service during the reporting period.
definition: Value of the revenue from sales of exports of the product/service during the reporting period.
has identifier: PI5920
notation: PI5920
had primary source: PI5920
scope note: This metric is intended to capture the organization’s sales revenue from products and services exported out of the country of operations.
defined by: giin

Waste Reductions from Products Sold
type: Concept
type: Code
has name: Waste Reductions from Products Sold
has description: Amount of waste reduced over the lifetime of products sold by the organization during the reporting period.
definition: Amount of waste reduced over the lifetime of products sold by the organization during the reporting period.
has identifier: PI5926
notation: PI5926
had primary source: PI5926
note: Organizations should footnote all assumptions used. See usage guidance for further information.
scope note: This metric is intended to capture waste reductions that result from products the organization produces and sells. For example, an organization that develops, manufactures, and markets machines used to recycle beverage containers (i.e., reverse vending machines) may report the amount of consumers' waste reduced by recycling containers over the lifetime of the machines sold. Organizations should report the lifetime waste reductions of those products sold during the reporting period; much of the waste reduction may actually occur after the reporting period, throughout the remainder of the products' lifetime. Such waste reduction might include efforts to reduce (i.e., using fewer inputs), reuse (e.g., repurposing rather than disposing or recycling excess inputs or unwanted outputs), or recycle (e.g., through established systems or through on-site processing) materials or energy through the products sold by the organization. Organizations wishing to report waste reductions achieved through their operations should report Waste Reduced (OI7920). Organizations wishing to report on waste reductions achieved through the provision of services should report Waste Reductions from Services Sold (PI5678). In some contexts, this metric may help measure the HOW MUCH Depth dimension of impact, which helps estimate the degree of change in outcome that the stakeholders experienced. For more on the alignment of IRIS metrics to the five dimensions of impact, see IRIS+ and the Five Dimensions of Impact (https://iris.thegiin.org/document/iris-and-the-five-dimensions/). No single metric is sufficient to understand an impact; rather, metrics are selected as a set across all dimensions of impact. When possible, the selection of metrics to measure and describe the five dimensions should be based on best practice and evidence.
defined by: giin

Average Agricultural Yield
type: Concept
type: Code
has name: Average Agricultural Yield
has description: Evaluates average agricultural yield per hectare of the set implied by another metric. For example, this metric applied to Client Individuals (PI4060) would yield the average agricultural yield of the organization's (farmer) clients. Organizations should calculate this metric for each individual agricultural product. See usage guidance for further information.
definition: Evaluates average agricultural yield per hectare of the set implied by another metric. For example, this metric applied to Client Individuals (PI4060) would yield the average agricultural yield of the organization's (farmer) clients. Organizations should calculate this metric for each individual agricultural product. See usage guidance for further information.
has identifier: PI5935
notation: PI5935
had primary source: PI5935
note: Organizations should footnote all assumptions used, including method for gathering yield data ((e.g., survey to a sample set of clients, survey to all clients).
scope note: This metric, applied to another metric, is intended to evaluate the average agricultural yield of the set implied by the other metric. Organizations can average actual yield data or survey a representative sample. For example, if evaluating average agricultural yield of client farmers using Client Individuals (PI4060), organizations could average actual yield data per farmer or survey representative individual farmers. Organizations should report yield separately for each agricultural product, reporting the relevant product with Crop Type (PD1620) or Livestock/Fish Type (PD4686), as appropriate. Organizations should also report yield from the most recent harvest and footnote details on the unit of measure per hectare (such as kilograms or bushels) using Unit of Measure (PD1602). This metric could be valuable for organizations that sell inputs (such as fertilizer or irrigation equipment) to farmers that help improve yields. In some contexts, this metric can serve as an indicator of whether the outcome being sought by an investor or organization is occurring (the WHAT dimension of impact). For more on the alignment of IRIS metrics to the five dimensions of impact, see IRIS+ and the Five Dimensions of Impact (https://iris.thegiin.org/document/iris-and-the-five-dimensions/). No single metric is sufficient to understand an impact; rather, metrics are selected as a set across all dimensions of impact. When possible, the selection of metrics to measure and describe the five dimensions should be based on best practice and evidence.
defined by: giin

School Enrollment: People with Disabilities
type: Concept
type: Code
has name: School Enrollment: People with Disabilities
has description: Number of students with disabilities enrolled as of the end of the reporting period, both full- and part-time, with each discrete student counted once regardless of their number of courses.
definition: Number of students with disabilities enrolled as of the end of the reporting period, both full- and part-time, with each discrete student counted once regardless of their number of courses.
has identifier: PI5954
notation: PI5954
had primary source: PI5954
note: Organizations should footnote all assumptions used, as well as any specific focus on stakeholders with particular disabilities. Organizations should also break down enrolled students with disabilities into full- and part-time.
scope note: This metric is intended to capture the number of students with disabilities enrolled at the school as of the end of the reporting period, including both full- and part-time students. Each discrete student should be counted once, regardless of number of courses taken. These data may be most effectively collected through either school reporting (for private schools) or government reporting (for public schools). This metric is multi-dimensional with regard to the five dimensions of impact. It may help describe the WHO dimension when the stakeholder group represented by the metric is the stakeholder group targeted by the investment or organization. It may also help measure the HOW MUCH Scale dimension, which helps estimate the number of the targeted stakeholders experiencing the outcome. For more on the alignment of IRIS metrics to the five dimensions of impact, see IRIS+ and the Five Dimensions of Impact (https://iris.thegiin.org/document/iris-and-the-five-dimensions/). No single metric is sufficient to understand an impact; rather, metrics are selected as a set across all dimensions of impact. When possible, the selection of metrics to measure and describe the five dimensions should be based on best practice and evidence.
defined by: giin

Number of Housing Units Financed
type: Concept
type: Code
has name: Number of Housing Units Financed
has description: Number of housing units projected to be constructed or preserved as a result of investments made by the organization during the reporting period.
definition: Number of housing units projected to be constructed or preserved as a result of investments made by the organization during the reporting period.
has identifier: PI5965
notation: PI5965
had primary source: PI5965
note: Organizations should footnote all assumptions used.
scope note: This metric is intended to capture the number of housing units constructed or preserved in both single- and multi-family buildings.
defined by: giin

Value of Commercial or Retail Infrastructure Financed
type: Concept
type: Code
has name: Value of Commercial or Retail Infrastructure Financed
has description: Value of commercial or retail infrastructure projected to be built or renovated as a result of investments made by the organization during the reporting period.
definition: Value of commercial or retail infrastructure projected to be built or renovated as a result of investments made by the organization during the reporting period.
has identifier: PI5983
notation: PI5983
had primary source: PI5983
note: Organizations should footnote all assumptions used.
scope note: This metric is intended to capture the value of real estate projected to be built or renovated for commercial or retail use as a result of investments made by the organization during the reporting period. Commercial real estate includes offices, industrial use, and retail, but not property used as living space (that is, residential real estate).
defined by: giin

Client Organizations: Receiving Free Services
type: Concept
type: Code
has name: Client Organizations: Receiving Free Services
has description: Number of enterprise clients that received free products/services from the organization during the reporting period.
definition: Number of enterprise clients that received free products/services from the organization during the reporting period.
has identifier: PI6050
notation: PI6050
had primary source: PI6050
note: Organizations should footnote all assumptions used, including source of data. Organizations should also footnote the types of enterprises that were clients, using Client Type (PD7993).
scope note: This metric is intended to capture the number of unique client organizations that received products or services provided during the reporting period by the organization for which it did not request payment and for which it does not expect reimbursement. Organizations should include the unique number of client organizations that received free products or services, regardless of whether or not they also paid the organization for certain other products or services during the reporting period.
defined by: giin

Number of Housing Units Improved
type: Concept
type: Code
has name: Number of Housing Units Improved
has description: Number of housing units improved or refurbished by the organization during the reporting period.
definition: Number of housing units improved or refurbished by the organization during the reporting period.
has identifier: PI6058
notation: PI6058
had primary source: PI6058
note: Organizations should footnote all assumptions used.
scope note: This metric is intended to capture the number of improved housing units completed by the organization during the reporting period, not those financed and still under construction. Organizations should include improved housing units in both single- and multi-family buildings.
defined by: giin

Organizations Trained
type: Concept
type: Code
has name: Organizations Trained
has description: Number of organizations that received training from the organization during the reporting period.
definition: Number of organizations that received training from the organization during the reporting period.
has identifier: PI6065
notation: PI6065
had primary source: PI6065
note: Organizations should footnote the type and extent of the training provided, as well as noting which organizations received the training. See usage guidance for further information.
scope note: This metric is intended to capture the number of organizations that received training services (of any type) from the organization during the reporting period. Examples include sessions on enterprise or business development, women’s empowerment, or diversity and inclusion, among other learning topics. Organizations should footnote details on the provided trainings. Training may or may not be restricted to clients of the organization and may be either fee-based or provided for free. Organizations should not include training of an organization’s own employees under this metric, which should instead be captured by Employees Trained (OI4229). This metric may apply to organizations operating in microfinance or agriculture, as well as other sectors in which organizations often provide training to clients and other community members. Organizations are encouraged to use Individuals Trained: Total (PI2998) to report the number of individuals trained. This metric may help describe the HOW MUCH Scale dimension, which helps estimate the number of the targeted stakeholders experiencing the outcome. For more on the alignment of IRIS metrics to the five dimensions of impact, see IRIS+ and the Five Dimensions of Impact (https://iris.thegiin.org/document/iris-and-the-five-dimensions/). No single metric is sufficient to understand an impact; rather, metrics are selected as a set across all dimensions of impact. When possible, the selection of metrics to measure and describe the five dimensions should be based on best practice and evidence.
defined by: giin

Supplier Individuals: Peri-urban
type: Concept
type: Code
has name: Supplier Individuals: Peri-urban
has description: Number of individuals residing in peri-urban areas who sold goods or services to the organization during the reporting period.
definition: Number of individuals residing in peri-urban areas who sold goods or services to the organization during the reporting period.
has identifier: PI6085
notation: PI6085
had primary source: PI6085
note: Organizations should footnote all assumptions used.
scope note: This metric is intended to capture how organizations support the livelihoods of individuals residing in peri-urban areas through their supply chains. This metric is multi-dimensional with regard to the five dimensions of impact: it may help describe the WHO dimension when the stakeholder group represented by the metric is the stakeholder group targeted by the investment or organization. It may also help measure the HOW MUCH Scale dimension, which helps estimate the number of the targeted stakeholders experiencing the outcome. For more on the alignment of IRIS metrics to the five dimensions of impact, see IRIS+ and the Five Dimensions of Impact (https://iris.thegiin.org/document/iris-and-the-five-dimensions/). No single metric is sufficient to understand an impact; rather, metrics are selected as a set across all dimensions of impact. When possible, the selection of metrics to measure and describe the five dimensions should be based on best practice and evidence.
defined by: giin

Supplier Individuals: Urban
type: Concept
type: Code
has name: Supplier Individuals: Urban
has description: Number of individuals residing in urban areas who sold goods or services to the organization during the reporting period.
definition: Number of individuals residing in urban areas who sold goods or services to the organization during the reporting period.
has identifier: PI6179
notation: PI6179
had primary source: PI6179
note: Organizations should footnote all assumptions used.
scope note: This metric is intended to capture how organizations support the livelihoods of individuals residing in urban areas through their supply chains. This metric is multi-dimensional with regard to the five dimensions of impact: it may help describe the WHO dimension when the stakeholder group represented by the metric is the stakeholder group targeted by the investment or organization. It may also help measure the HOW MUCH Scale dimension, which helps estimate the number of the targeted stakeholders experiencing the outcome. For more on the alignment of IRIS metrics to the five dimensions of impact, see IRIS+ and the Five Dimensions of Impact (https://iris.thegiin.org/document/iris-and-the-five-dimensions/). No single metric is sufficient to understand an impact; rather, metrics are selected as a set across all dimensions of impact. When possible, the selection of metrics to measure and describe the five dimensions should be based on best practice and evidence.
defined by: giin

Supplier Individuals: People with Disabilities
type: Concept
type: Code
has name: Supplier Individuals: People with Disabilities
has description: Number of individuals with disabilities who sold goods or services to the organization during the reporting period.
definition: Number of individuals with disabilities who sold goods or services to the organization during the reporting period.
has identifier: PI6189
notation: PI6189
had primary source: PI6189
note: Organizations should footnote all assumptions used, as well as any specific focus on stakeholders with particular disabilities.
scope note: This metric is intended to capture how organizations support the livelihoods of individuals with disabilities through their supply chains. This metric is multi-dimensional with regard to the five dimensions of impact: it may help describe the WHO dimension when the stakeholder group represented by the metric is the stakeholder group targeted by the investment or organization. It may also help measure the HOW MUCH Scale dimension, which helps estimate the number of the targeted stakeholders experiencing the outcome. For more on the alignment of IRIS metrics to the five dimensions of impact, see IRIS+ and the Five Dimensions of Impact (https://iris.thegiin.org/document/iris-and-the-five-dimensions/). No single metric is sufficient to understand an impact; rather, metrics are selected as a set across all dimensions of impact. When possible, the selection of metrics to measure and describe the five dimensions should be based on best practice and evidence.
defined by: giin

Earnings of Distributor Organizations: Total
type: Concept
type: Code
has name: Earnings of Distributor Organizations: Total
has description: Earnings of distributor enterprises as a result of selling the organization’s products/services during the reporting period.
definition: Earnings of distributor enterprises as a result of selling the organization’s products/services during the reporting period.
has identifier: PI6218
notation: PI6218
had primary source: PI6218
note: Organizations should footnote all assumptions used.
scope note: This metric is intended to capture the earnings, during the reporting period, of all distributors that sell the organization’s products or services either to other distributors (wholesale) or to end clients (retail). Distributors counted under this metric need not exclusively sell the organization’s products or services. Direct employees who distribute the organization’s goods or services should be considered employees, not distributors.
defined by: giin

Client Individuals: People with Disabilities
type: Concept
type: Code
has name: Client Individuals: People with Disabilities
has description: Number of unique individuals with disabilities who were clients of the organization during the reporting period.
definition: Number of unique individuals with disabilities who were clients of the organization during the reporting period.
has identifier: PI6266
notation: PI6266
had primary source: PI6266
note: Organizations should footnote all assumptions used, including source of data. See usage guidance for further information.
scope note: This metric is intended to capture the number of unique clients with disabilities who received the organization’s products or services during the reporting period. It is not a measure of foot traffic, nor is it intended to capture the number of consumer transactions. For example, a customer who makes two purchases during a period should be counted only once. Organizations wishing to report on total client transactions should refer to Client Transactions (PI5184). This metric is intended to capture the unique number of specific individuals served. Organizations should not use any household multipliers when reporting against this metric. If organizations consider entire households to be the customer/client, they can report against Client Households: Total (PI7954) and its associated submetrics. Many organizations may not be able to report on the number of clients using direct data. For example, organizations that sell solar lanterns through a series of local network distributors might estimate the number of client individuals reached based on the number of units sold. Organizations should footnote details on how and why these assumptions were made. For healthcare providers, “client individuals” refers to patients. For housing providers, “client individuals” refers to residents or tenants. This metric is multi-dimensional with regard to the five dimensions of impact. It may help describe the WHO dimension when the stakeholder group represented by the metric is the stakeholder group targeted by the investment or organization. It may also help measure the HOW MUCH Scale dimension, which helps estimate the number of the targeted stakeholders experiencing the outcome. For more on the alignment of IRIS metrics to the five dimensions of impact, see IRIS+ and the Five Dimensions of Impact (https://iris.thegiin.org/document/iris-and-the-five-dimensions/). No single metric is sufficient to understand an impact; rather, metrics are selected as a set across all dimensions of impa…
defined by: giin

Eviction Rate
type: Concept
type: Code
has name: Eviction Rate
has description: Percentage of permanent tenants involuntarily removed from housing units during the reporting period.
definition: Percentage of permanent tenants involuntarily removed from housing units during the reporting period.
has identifier: PI6303
notation: PI6303
had primary source: PI6303
note: Organizations should footnote the reasons for each eviction and where individuals transitioned (e.g., shelters, other supportive housing structures, other, or unknown). Organizations should also footnote any assumptions used.
scope note: This metric is intended to capture the rate at which individuals are involuntarily removed from housing units. Organizations should footnote the reasons for their removal. Organizations should calculate the number of tenants involuntarily removed from housing (‘evicted’) during the reporting period on the same basis as the total number of tenants reported under Client Individuals: Total (PI4060). If, for instance, the reporting organization manages housing units, the organization should calculate the number of tenants (and the number of evicted tenants) in housing units managed by the organization. If the reporting organization finances housing units, the organization should report the number of tenants (and evicted tenants) in housing units financed by the organization. In specific contexts, and based on evidence, this metric may serve as a proxy indicator of whether the outcome being sought by an investor or organization is occurring (the WHAT dimension of impact). For more on the alignment of IRIS metrics to the five dimensions of impact, see IRIS+ and the Five Dimensions of Impact (https://iris.thegiin.org/document/iris-and-the-five-dimensions/). No single metric is sufficient to understand an impact; rather, metrics are selected as a set across all dimensions of impact. When possible, the selection of metrics to measure and describe the five dimensions should be based on best practice and evidence.
defined by: giin

Client Individuals: Smallholder
type: Concept
type: Code
has name: Client Individuals: Smallholder
has description: Number of unique smallholder farmer individuals who were clients during the reporting period.
definition: Number of unique smallholder farmer individuals who were clients during the reporting period.
has identifier: PI6372
notation: PI6372
had primary source: PI6372
note: Organizations should footnote all assumptions used, including source of data. See usage guidance for further information.
scope note: This metric is intended to capture the number of unique smallholder farmer clients who received the organization's products or services during the reporting period. It is not a measure of foot traffic, nor is it intended to capture the number of client transactions. For example, a smallholder farmer customer who makes two purchases during a period should only be counted once. Organizations wishing to report on client purchases should refer to Client Transactions (PI5184). Since this metric is intended to capture the unique number of specific individuals serviced, organizations should not apply any household multipliers to their reports against this metric. If organizations consider entire households to be the customer/client, they can report against Client Households: Total (PI7954) and its associated submetrics. Organizations that rely on assumptions to report against this metric, including in the process for determining the number of client individuals, should footnote all assumptions used in their calculation process. For healthcare providers, “client individuals” refers to patients. For housing providers, “client individuals” refers to residents or tenants. This metric is multi-dimensional with regard to the five dimensions of impact. It may help describe the WHO dimension when the stakeholder group represented by the metric is the stakeholder group targeted by the investment or organization. It may also help measure the HOW MUCH Scale dimension, which helps estimate the number of the targeted stakeholders experiencing the outcome. For more on the alignment of IRIS metrics to the five dimensions of impact, see IRIS+ and the Five Dimensions of Impact (https://iris.thegiin.org/document/iris-and-the-five-dimensions/). No single metric is sufficient to understand an impact; rather, metrics are selected as a set across all dimensions of impact. When possible, the selection of metrics to measure and describe the five dimensions should be based on best practice and evi…
defined by: giin

Supplier Organizations: Local
type: Concept
type: Code
has name: Supplier Organizations: Local
has description: Number of local enterprises that sold goods or services to the organization during the reporting period.
definition: Number of local enterprises that sold goods or services to the organization during the reporting period.
has identifier: PI6385
notation: PI6385
had primary source: PI6385
note: Organizations should footnote their definition of “local”. See usage guidance for further information.
scope note: This metric is intended to capture information about the local enterprises that supply goods or services to the reporting organization. Organizations can themselves determine the precise threshold at which they report suppliers. In most cases, organizations should include only those enterprises supplying goods and services that are fundamental to the operations of the reporting organization. Individual organizations’ definitions of local will depend on their business models and impact objectives. For example, if their purpose is economic development, they may define “local” within geo-political boundaries. If they focus on reducing emissions, they may define “local” by specific distance. Organizations should not include subcontractors as part of this metric; subcontractors can be reported under Temporary Employees (OI9028) and its related submetrics. This metric is multi-dimensional with regard to the five dimensions of impact: it may help describe the WHO dimension when the stakeholder group represented by the metric is the stakeholder group targeted by the investment or organization. It may also help measure the HOW MUCH Scale dimension, which helps estimate the number of the targeted stakeholders experiencing the outcome. For more on the alignment of IRIS metrics to the five dimensions of impact, see IRIS+ and the Five Dimensions of Impact (https://iris.thegiin.org/document/iris-and-the-five-dimensions/). No single metric is sufficient to understand an impact; rather, metrics are selected as a set across all dimensions of impact. When possible, the selection of metrics to measure and describe the five dimensions should be based on best practice and evidence.
defined by: giin

New Businesses Created: Low Income Areas
type: Concept
type: Code
has name: New Businesses Created: Low Income Areas
has description: Number of new businesses created in low-income areas as a result of investments made by the organization during the reporting period.
definition: Number of new businesses created in low-income areas as a result of investments made by the organization during the reporting period.
has identifier: PI6414
notation: PI6414
had primary source: PI6414
note: Organizations should footnote all assumptions used, including how they identify low-income areas. See usage guidance for further information.
scope note: This metric is intended to capture the number of new businesses created in low-income areas as a result of investment, a proxy of economic activity. See the glossary definition for additional information on commonly used tools to help identify low-income areas.
defined by: giin

Number of Voluntary Savings Accounts
type: Concept
type: Code
has name: Number of Voluntary Savings Accounts
has description: Number of voluntary savings accounts managed by the organization, including demand deposits and time deposits, as of the end of the reporting period.
definition: Number of voluntary savings accounts managed by the organization, including demand deposits and time deposits, as of the end of the reporting period.
has identifier: PI6439
notation: PI6439
had primary source: PI6439
note: Organizations should footnote all assumptions used.
scope note: This metric is intended to capture the number of voluntary savings accounts managed by the organization as of the end of the reporting period. Organizations reporting this metric may include savings programs with incentives or obligatory savings that clients can opt into (not including guarantees). While this metric measures the value of formal savings (voluntary savings accounts), those interested in measuring financial health may also wish to measure or estimate informal and non-cash savings.
defined by: giin

Average Vehicle Speed
type: Concept
type: Code
has name: Average Vehicle Speed
has description: Average speed of vehicles on roads, waterways, or in flight during the reporting period.
definition: Average speed of vehicles on roads, waterways, or in flight during the reporting period.
has identifier: PI6471
notation: PI6471
had primary source: PI6471
note: Organizations should footnote all assumptions used, including source of data.
scope note: This metric is intended to capture the average speed of vehicles on roads or other routes during the reporting period, which can help organizations understand whether new or improved infrastructure has created efficiencies in transportation. This is a measure of quality of service for clients (passengers). This metric is often used by International Finance Institutions (IFIs) as part of transportation analysis. Organizations choosing to report according to HIPSO (Harmonized Indicators for Private Sector Operations) indicators should disaggregate this measure by urban and non-urban roads.
defined by: giin

Number of Routes Served
type: Concept
type: Code
has name: Number of Routes Served
has description: Number of directly connected port pairs or routes served during the reporting period.
definition: Number of directly connected port pairs or routes served during the reporting period.
has identifier: PI6504
notation: PI6504
had primary source: PI6504
note: Organizations should footnote all assumptions used.
scope note: This metric is intended to capture the number of routes served by the organization's transportation services. For example, an airline serving 62 direct flights from city to city would report 62 for this metric. This metric may be most useful for investments in large-scale infrastructure and transportation. This metric is often used by International Finance Institutions (IFIs) as part of infrastructure analysis. This metric may help describe the HOW MUCH Scale dimension, which helps estimate the number of the targeted stakeholders experiencing the outcome. For more on the alignment of IRIS metrics to the five dimensions of impact, see IRIS+ and the Five Dimensions of Impact (https://iris.thegiin.org/document/iris-and-the-five-dimensions/). No single metric is sufficient to understand an impact; rather, metrics are selected as a set across all dimensions of impact. The selection of metrics to measure and describe the five dimensions should be based on best practice and evidence.
defined by: giin

School Enrollment: Rural
type: Concept
type: Code
has name: School Enrollment: Rural
has description: Number of students residing in rural areas enrolled as of the end of the reporting period, both full- and part-time, with each discrete student counted once regardless of their number of courses.
definition: Number of students residing in rural areas enrolled as of the end of the reporting period, both full- and part-time, with each discrete student counted once regardless of their number of courses.
has identifier: PI6569
notation: PI6569
had primary source: PI6569
note: Organizations should footnote all assumptions used. Organizations should also break down enrolled students residing in rural areas into full- and part-time.
scope note: This metric is intended to capture the number of students who live in rural environments and who are enrolled at the school as of the end of the reporting period, including both full- and part-time students. Each discrete student should be counted once, regardless of number of courses taken. These data may be most effectively collected through either school reporting (for private schools) or government reporting (for public schools). This metric is multi-dimensional with regard to the five dimensions of impact. It may help describe the WHO dimension when the stakeholder group represented by the metric is the stakeholder group targeted by the investment or organization. It may also help measure the HOW MUCH Scale dimension, which helps estimate the number of the targeted stakeholders experiencing the outcome. For more on the alignment of IRIS metrics to the five dimensions of impact, see IRIS+ and the Five Dimensions of Impact (https://iris.thegiin.org/document/iris-and-the-five-dimensions/). No single metric is sufficient to understand an impact; rather, metrics are selected as a set across all dimensions of impact. When possible, the selection of metrics to measure and describe the five dimensions should be based on best practice and evidence.
defined by: giin

Units/Volume Purchased from Supplier Individuals: Historically Marginalized
type: Concept
type: Code
has name: Units/Volume Purchased from Supplier Individuals: Historically Marginalized
has description: Units/volume purchased from individuals belonging to groups historically marginalized on the basis of race and/or ethnicity who sold to the reporting organization during the reporting period.
definition: Units/volume purchased from individuals belonging to groups historically marginalized on the basis of race and/or ethnicity who sold to the reporting organization during the reporting period.
has identifier: PI6646
notation: PI6646
had primary source: PI6646
note: Organizations should footnote how they categorize historically marginalized groups and all other assumptions used, including source of data.
scope note: This metric is intended to capture the total units or volume an organization purchased during the reporting period from suppliers who are individuals from groups historically marginalized on the basis of race and/or ethnicity. Organizations that purchase different types of products/services should consider reporting separately against each different type of product/service. Organizations may wish to use this metric in conjunction with Supplier Individuals: Historically Marginalized (PI9261).
defined by: giin

Client Individuals: Rural
type: Concept
type: Code
has name: Client Individuals: Rural
has name: Units/Volume Purchased from Supplier Organizations: Certified
preferred label: Units/Volume Purchased from Supplier Organizations: Certified
has description: Number of unique individuals residing in rural areas who were clients of the organization during the reporting period.
has description: Organizations should footnote details on the certification and all other assumptions used, including source of data. See usage guidance for further information.
definition: Number of unique individuals residing in rural areas who were clients of the organization during the reporting period.
definition: Organizations should footnote details on the certification and all other assumptions used, including source of data. See usage guidance for further information.
has identifier: PI6652
notation: PI6652
had primary source: PI6652
note: Organizations should footnote all assumptions used, including source of data. See usage guidance for further information.
note: Organizations should footnote details on the certification and all assumptions used. See usage guidance for further information.
scope note: This metric is intended to capture the number of unique rural clients who received the organization’s products or services during the reporting period. It is not a measure of foot traffic, nor is it intended to capture the number of consumer transactions. For example, a customer who makes two purchases during a period should be counted only once. Organizations wishing to report on total client transactions should refer to Client Transactions (PI5184). This metric is intended to capture the unique number of specific individuals served. Organizations should not use any household multipliers when reporting against this metric. If organizations consider entire households to be the customer/client, they can report against Client Households: Total (PI7954) and its associated submetrics. Many organizations may not be able to report on the number of clients using direct data. For example, organizations that sell solar lanterns through a series of local network distributors might estimate the number of client individuals reached based on the number of units sold. Organizations should footnote details on how and why these assumptions were made. For healthcare providers, “client individuals” refers to patients. For housing providers, “client individuals” refers to residents or tenants. This metric is multi-dimensional with regard to the five dimensions of impact. It may help describe the WHO dimension when the stakeholder group represented by the metric is the stakeholder group targeted by the investment or organization. It may also help measure the HOW MUCH Scale dimension, which helps estimate the number of the targeted stakeholders experiencing the outcome. For more on the alignment of IRIS metrics to the five dimensions of impact, see IRIS+ and the Five Dimensions of Impact (https://iris.thegiin.org/document/iris-and-the-five-dimensions/). No single metric is sufficient to understand an impact; rather, metrics are selected as a set across all dimensions of impact. When pos…
scope note: This metric is intended to capture the total units or volume an organization purchased from certified supplier organizations during the reporting period. Certification must come from a third party, be based on transparent standards, and have an assurance process. The process of certification must be carried out by a recognized third-party body, independent from interested parties, which demonstrates that a product or organization complies with the requirements defined by the standards or technical specifications. Examples of such certifications include: UTZ Certified, Fair Trade (WFTO fair trade standard), Common Code for the Coffee Community (C4), Rainforest Alliance agriculture certification, Marine Stewardship Council (MSC), Forest Stewardship Council (FSC). Organizations should footnote relevant details about the certification (such as certification name and certifying body) and can do so by reporting separately on Product/Service Certifications (PD2756). Organizations that purchase different types of products/services should consider reporting separately against each different type of product/service.
defined by: giin

Distributor Individuals: Female
type: Concept
type: Code
has name: Distributor Individuals: Female
has description: Number of female individuals who served as distributors of the organization’s products/services during the reporting period.
definition: Number of female individuals who served as distributors of the organization’s products/services during the reporting period.
has identifier: PI6659
notation: PI6659
had primary source: PI6659
note: Organizations should footnote all assumptions used.
scope note: This metric is intended to capture how many self-employed female individuals sold the organization’s products or services during the reporting period, either to other distributors (wholesale) or to ultimate consumers (retail). Distributors counted under this metric need not exclusively sell the organization’s products or services. Direct employees who distribute the organization’s goods or services should be considered employees, not distributors. This metric is multi-dimensional with regard to the five dimensions of impact: it may help describe the WHO dimension when the stakeholder group represented by the metric is the stakeholder group targeted by the investment or organization. It may also help measure the HOW MUCH Scale dimension, which helps estimate the number of the targeted stakeholders experiencing the outcome. For more on the alignment of IRIS metrics to the five dimensions of impact, see IRIS+ and the Five Dimensions of Impact (https://iris.thegiin.org/document/iris-and-the-five-dimensions/). No single metric is sufficient to understand an impact; rather, metrics are selected as a set across all dimensions of impact. When possible, the selection of metrics to measure and describe the five dimensions should be based on best practice and evidence.
defined by: giin

Service Area Population
type: Concept
type: Code
has name: Service Area Population
has description: Number of individuals within the organization's service area (municipality, administrative region, or other geographic boundary) as of the end of the reporting period.
definition: Number of individuals within the organization's service area (municipality, administrative region, or other geographic boundary) as of the end of the reporting period.
has identifier: PI6686
notation: PI6686
had primary source: PI6686
note: Organizations should footnote all assumptions used, including source(s) of data and the boundaries of the service area.
scope note: This metric is intended to capture the total population of the area served, whether or not the organization is providing services to all of them. Distinct from Client Individuals: Total (PI4060), this metric counts the total population in an area of coverage. For example, a water utility provider may serve an area with 45 million individuals while actively providing service to 20 million individuals, measured by Client Individuals: Total (PI4060). Population area data may be best sourced from census records or other municipal, regional, or national records. For locations where population varies significantly at different times of the year, organizations should footnote these seasonal shifts. This metric may help describe the WHO dimension of impact, which details which stakeholders the investment or enterprise aims to reach with the outcome. This metric may also help clarify how underserved they were prior to the investment. For more on the alignment of IRIS metrics to the five dimensions of impact, see IRIS+ and the Five Dimensions of Impact (https://iris.thegiin.org/document/iris-and-the-five-dimensions/). No single metric is sufficient to understand an impact; rather, metrics are selected as a set across all dimensions of impact. The selection of metrics to measure and describe the five dimensions should be based on best practice and evidence.
defined by: giin

Client Households: Very Poor
type: Concept
type: Code
has name: Client Households: Very Poor
has description: Number of unique very poor households that were clients of the organization during the reporting period.
definition: Number of unique very poor households that were clients of the organization during the reporting period.
has identifier: PI6705
notation: PI6705
had primary source: PI6705
note: Organizations should footnote all assumptions used, including source of data, as well as details on the assessment tools used to identify the poverty level of client households. See usage guidance for further information.
scope note: This metric is intended to capture the number of unique very poor households that received the organization’s products or services during the reporting period. Examples of organizations that might report against this metric include those that provide products such as clean cookstoves or water purification systems and those that provide services such as home weatherization. Organizations that provide goods and services at the individual level, such as vaccines or school lunches, may find it more appropriate to report against Client Individuals: Total (PI4060) and related submetrics. Because assessing the poverty level of client households is complex, organizations will likely have to use specific assessment tools to accurately report on this metric. See the glossary definition for additional information on commonly used tools to help determine the absolute poverty level of individuals and households. Many organizations may not be able to report on the number of client households using direct data. For example, organizations that sell water purification systems through a series of local network distributors might estimate the number of client households reached based on the number of units sold. Organizations should footnote details on how and why these assumptions were made. This metric is multi-dimensional with regard to the five dimensions of impact. It may help describe the WHO dimension when the stakeholder group represented by the metric is the stakeholder group targeted by the investment or organization. It may also help measure the HOW MUCH Scale dimension, which helps estimate the number of the targeted stakeholders experiencing the outcome. For more on the alignment of IRIS metrics to the five dimensions of impact, see IRIS+ and the Five Dimensions of Impact (https://iris.thegiin.org/document/iris-and-the-five-dimensions/). No single metric is sufficient to understand an impact; rather, metrics are selected as a set across all dimensions of impact. When poss…
defined by: giin

Client Individuals: Urban
type: Concept
type: Code
has name: Client Individuals: Urban
has description: Number of unique individuals residing in urban areas who were clients of the organization during the reporting period.
definition: Number of unique individuals residing in urban areas who were clients of the organization during the reporting period.
has identifier: PI6751
notation: PI6751
had primary source: PI6751
note: Organizations should footnote all assumptions used, including source of data. See usage guidance for further information.
scope note: This metric is intended to capture the number of unique urban clients who received the organization’s products or services during the reporting period. It is not a measure of foot traffic, nor is it intended to capture the number of consumer transactions. For example, a customer who makes two purchases during a period should be counted only once. Organizations wishing to report on total client transactions should refer to Client Transactions (PI5184). This metric is intended to capture the unique number of specific individuals served. Organizations should not use any household multipliers when reporting against this metric. If organizations consider entire households to be the customer/client, they can report against Client Households: Total (PI7954) and its associated submetrics. Many organizations may not be able to report on the number of clients using direct data. For example, organizations that sell solar lanterns through a series of local network distributors might estimate the number of client individuals reached based on the number of units sold. Organizations should footnote details on how and why these assumptions were made. For healthcare providers, “client individuals” refers to patients. For housing providers, “client individuals” refers to residents or tenants. This metric is multi-dimensional with regard to the five dimensions of impact. It may help describe the WHO dimension when the stakeholder group represented by the metric is the stakeholder group targeted by the investment or organization. It may also help measure the HOW MUCH Scale dimension, which helps estimate the number of the targeted stakeholders experiencing the outcome. For more on the alignment of IRIS metrics to the five dimensions of impact, see IRIS+ and the Five Dimensions of Impact (https://iris.thegiin.org/document/iris-and-the-five-dimensions/). No single metric is sufficient to understand an impact; rather, metrics are selected as a set across all dimensions of impact. When pos…
defined by: giin

Land Indirectly Controlled: Sustainably Managed
type: Concept
type: Code
has name: Land Indirectly Controlled: Sustainably Managed
has description: Area of land indirectly controlled by the organization and under sustainable cultivation or sustainable stewardship. Report indirectly controlled land area sustainably managed during the reporting period.
definition: Area of land indirectly controlled by the organization and under sustainable cultivation or sustainable stewardship. Report indirectly controlled land area sustainably managed during the reporting period.
has identifier: PI6796
notation: PI6796
had primary source: PI6796
note: Organizations should footnote details about the nature of the indirect control relationship and all assumptions used, including source of data. See usage guidance for further information.
scope note: The IRIS catalog differentiates between land that the organization directly controls and land that the organization indirectly controls. This metric is intended to capture the area of land that is under the organization's indirect control. Indirect control refers to land that the organization supports or influences but does not directly cultivate or manage. Examples in which an organization indirectly controls land may include purchase contracts or sourcing from farmer cooperatives. Organizations that exert control over land practices of indirectly controlled land should footnote these details (for example, when an organization specifies that farmers adhere to specific environmental practices).
defined by: giin

Patients Screened
type: Concept
type: Code
has name: Patients Screened
has description: Number of patients screened for medical conditions, illnesses, or risk factors during the reporting period.
definition: Number of patients screened for medical conditions, illnesses, or risk factors during the reporting period.
has identifier: PI6845
notation: PI6845
had primary source: PI6845
note: Organizations should footnote details on screenings completed, in addition to all assumptions used.
scope note: This metric is intended to capture the number of patients who were successfully screened and informed of the outcomes of that screening during the reporting period. In some contexts, this metric can serve as an indicator of whether the outcome being sought by an investor or organization is occurring (the WHAT dimension of impact). For more on the alignment of IRIS metrics to the five dimensions of impact, see IRIS+ and the Five Dimensions of Impact (https://iris.thegiin.org/document/iris-and-the-five-dimensions/). No single metric is sufficient to understand an impact; rather, metrics are selected as a set across all dimensions of impact. When possible, the selection of metrics to measure and describe the five dimensions should be based on best practice and evidence.
defined by: giin

Payments to Supplier Individuals: People with Disabilities
type: Concept
type: Code
has name: Payments to Supplier Individuals: People with Disabilities
has description: Value of payments made by the organization to individuals with disabilities who sold goods or services to the organization during the reporting period.
definition: Value of payments made by the organization to individuals with disabilities who sold goods or services to the organization during the reporting period.
has identifier: PI6858
notation: PI6858
had primary source: PI6858
note: Organizations should footnote all assumptions used, as well as any specific focus on stakeholders with particular disabilities.
scope note: This metric is intended to capture how organizations support the livelihoods of individuals with disabilities through their supply chains.
defined by: giin

Length of Streams Restored
type: Concept
type: Code
has name: Length of Streams Restored
has description: Length of freshwater streams under management for ecological restoration on protected land, land under sustainable stewardship, or land under sustainable cultivation during the reporting period.
definition: Length of freshwater streams under management for ecological restoration on protected land, land under sustainable stewardship, or land under sustainable cultivation during the reporting period.
has identifier: PI6885
notation: PI6885
had primary source: PI6885
note: Organizations should footnote all assumptions used, as well as relevant ecological restoration activities undertaken during the reporting period.
scope note: This metric is intended to capture the entire length of streams the organization is working to restore during the reporting period, not just any additional length of streams that began restoration during the reporting period. Freshwater streams and rivers are home to many species and provide a broad range of ecosystem services. Although freshwater habitats support both life below water and on land, they face threats from pollution, land use changes, and invasive species that can be countered by restoration and conservation management. Organizations can refer to the glossary for additional information on ecological restoration.
defined by: giin

Biodiversity Footprint
type: Concept
type: Code
has name: Biodiversity Footprint
has description: Describes the organization’s biodiversity footprint -- a measure of ecosystem intactness – on area directly or indirectly controlled by the organization as of the end of the reporting period.
definition: Describes the organization’s biodiversity footprint -- a measure of ecosystem intactness – on area directly or indirectly controlled by the organization as of the end of the reporting period.
has identifier: PI6887
notation: PI6887
had primary source: PI6887
note: Organizations should footnote details on their or their product’s biodiversity footprint and how it was assessed, including all assumptions used. See usage guidance for further information.
scope note: This metric is intended to capture the organization’s or product’s biodiversity footprint, a measure of impact on the intactness of an ecosystem usually expressed relative to an undisturbed state. Biodiversity footprint can be assessed at the level of a product, a project, a site, or the entire organization. While it does not require time- and cost-intensive field surveys, this metric is not intended to offer an extremely accurate or holistic picture of biodiversity performance. Organizations can apply this metric in benchmarking (‘which companies in my portfolio are scoring well in terms of biodiversity?’), tracking progress to target (‘are companies in my portfolio evolving towards improved biodiversity performance?’), and comparison (‘which investment options are most promising in terms of biodiversity performance?’). Organizations are encouraged to report this metric alongside others in the Biodiversity IRIS+ Core Metrics Set, as tailored to context, that give a complementary, more complete picture of biodiversity performance. Organizations are encouraged to apply standard indicators for biodiversity footprint. Typically based on a combination of extent (surface), condition, and significance of the local ecosystem, commonly applied condition indicators include Mean Species Abundance (MSA) and Potentially Disappeared Fraction of Species (PDF), often combined with surface metrics (e.g., MSA.ha or MSA per hectare). PDF expresses the (potential) loss of species, while MSA expresses the abundance of species remaining (MSA, as a measure of current intactness, is preferred for this IRIS indicator). These indicators are often normalized to fall between 0 and 1; with MSA, for instance, no biodiversity is left when MSA = 0, while a very pristine area has MSA = 1. Both MSA and PDF can be used across all sectors and across all countries and (eco)regions. For more on these measures as well as an overall discussion of the biodiversity footprint and its application to differen…
defined by: giin

Client Organizations: New
type: Concept
type: Code
has name: Client Organizations: New
has description: Number of enterprises that were first-time clients of the organization during the reporting period.
definition: Number of enterprises that were first-time clients of the organization during the reporting period.
has identifier: PI6894
notation: PI6894
had primary source: PI6894
note: Organizations should footnote all assumptions used, including source of data. Organizations should also footnote the types of enterprises that were clients, using Client Type (PD7993).
scope note: This metric is intended to capture the number of enterprises (other organizations) that were unique clients of the reporting organization for the first time during the reporting period. This metric is multi-dimensional with regard to the five dimensions of impact. It may help describe the WHO dimension when the stakeholder group represented by the metric is the stakeholder group targeted by the investment or organization. It may also help measure the HOW MUCH Scale dimension, which helps estimate the number of the targeted stakeholders experiencing the outcome. For more on the alignment of IRIS metrics to the five dimensions of impact, see IRIS+ and the Five Dimensions of Impact (https://iris.thegiin.org/document/iris-and-the-five-dimensions/). No single metric is sufficient to understand an impact; rather, metrics are selected as a set across all dimensions of impact. When possible, the selection of metrics to measure and describe the five dimensions should be based on best practice and evidence.
defined by: giin

Cost Transparency
type: Concept
type: Code
has name: Cost Transparency
has description: Indicates whether the organization fully discloses all pricing and cost information for its products and services to its clients.
definition: Indicates whether the organization fully discloses all pricing and cost information for its products and services to its clients.
has identifier: PI6941
notation: PI6941
had primary source: PI6941
note: Organizations should footnote details on the type of information disclosed and how it is disclosed, if applicable. See usage guidance for further information.
scope note: This metric is intended to capture the organization’s transparency around pricing and cost. Pricing and cost information disclosed, to footnote, could include installments; terms and conditions of products, including all charges and fees; associated prices; penalties; linked products; third-party fees; and whether any of these can change over time. Financial organizations interested in more detail should reference the Smart Campaign’s Client Protection Principles (www.smartcampaign.org).
defined by: giin

School Meals
type: Concept
type: Code
has name: School Meals
has description: Number of free or subsidized meals provided by the organization during the reporting period.
definition: Number of free or subsidized meals provided by the organization during the reporting period.
has identifier: PI6971
notation: PI6971
had primary source: PI6971
note: Organizations should footnote all assumptions used.
scope note: This metric is intended to capture the quantity of meals provided by the organization (school) to target stakeholders (for example, students) for free or at a subsidized price during the reporting period. Organizations should include both meals funded directly by the organization and those paid for by another organization or specific donors. Meals included in this calculation may be provided to both full- and part-time students, if applicable, with each discrete student counted once regardless of the number of courses taken. This metric and the associated Percent Students Receiving Free and Subsidized School Meals (PI4555) are frequently used as a proxy of poverty at the school level. For example, a financial institution that provides a loan to a school may seek to gauge the income level of the targeted stakeholders of its loan by requiring the school receiving the loan to report this metric. Organizations are also encouraged to report metrics such as School Enrollment: Poor (PI7254), School Enrollment: Very Poor (PI5583), or School Enrollment: Low Income (PI2173) if they have additional demographic details available. Organizations operating in the United States can refer to the following sources for additional information on free and reduced-price meal programs and eligibility: - New America School Funding and Resources/Nutrition (http://atlas.newamerica.org/federal-school-nutrition-programs#toc-eligibility-and-enrollment) - USDA Food and Nutrition Service: Income Eligibility Guidelines (http://www.fns.usda.gov/school-meals/income-eligibility-guidelines)
defined by: giin

Client Households: New
type: Concept
type: Code
has name: Client Households: New
has description: Number of unique households who were first-time clients of the organization during the reporting period.
definition: Number of unique households who were first-time clients of the organization during the reporting period.
has identifier: PI6991
notation: PI6991
had primary source: PI6991
note: Organizations should footnote all assumptions used, including source of data. See usage guidance for further information.
scope note: This metric is intended to capture the number of unique households that received the organization's products or services during the reporting period for the first time. Examples of organizations that might report against this metric include those that provide products such as clean cookstoves or water purification systems and those that provide services such as home weatherization. Organizations that provide goods and services at the individual level, such as vaccines or school lunches, may find it more appropriate to report against Client Individuals: Total (PI4060) and related submetrics. Depending on the industry and business model, organizations may define new clients as those who re-engage with the organization after a designated time period. For example, the Microfinance Information Exchange (MIX) defines new borrowers as either those who receive loans for the first time from the institution or borrowers who rejoin after more than one year. Many organizations may not be able to report on the number of client households using direct data. For example, organizations that sell water purification systems through a series of local network distributors might estimate the number of client households reached based on the number of units sold. Organizations should footnote details on how and why these assumptions were made. This metric is multi-dimensional with regard to the five dimensions of impact. It may help describe the WHO dimension when the stakeholder group represented by the metric is the stakeholder group targeted by the investment or organization. It may also help measure the HOW MUCH Scale dimension, which helps estimate the number of the targeted stakeholders experiencing the outcome. For more on the alignment of IRIS metrics to the five dimensions of impact, see IRIS+ and the Five Dimensions of Impact (https://iris.thegiin.org/document/iris-and-the-five-dimensions/). No single metric is sufficient to understand an impact; rather, metrics are selected as …
defined by: giin

Greenhouse Gas Emissions of Energy Generated for Sale
type: Concept
type: Code
has name: Greenhouse Gas Emissions of Energy Generated for Sale
has description: Amount of greenhouse gases (GHG) emitted through production of energy by the organization that was delivered to offtaker(s) during the reporting period.
definition: Amount of greenhouse gases (GHG) emitted through production of energy by the organization that was delivered to offtaker(s) during the reporting period.
has identifier: PI7015
notation: PI7015
had primary source: PI7015
note: Organizations should footnote assumptions and tools used in emissions calculation, including source of data, along with the type(s) of energy delivered to offtaker(s).
scope note: This metric is intended to capture the GHG emissions of energy that organizations produce for commercial sale (that is, not for the organization's operations). Bulk energy is usually sold under a power purchase agreement with an electricity utility. The buyer or purchaser of this energy is termed the offtaker. This metric can be reported in conjunction with Energy Generated for Sale: Total (PI8706). Organizations are also encouraged to footnote the year-over-year changes in the type(s) of energy generated for sale, along with corresponding changes to GHG emissions. Organizations can refer to the following sources for further guidance: - WRI Greenhouse Gas Protocol Standards (http://www.ghgprotocol.org/standards) - International Panel on Climate Change (IPCC) emission factors (http://www.ipcc-nggip.iges.or.jp) - Global Reporting Initiative (https://www.globalreporting.org/reporting/g4/Pages/default.aspx) - CDM Methodologies (http://cdm.unfccc.int/methodologies/index.html) The Greenhouse Gas Protocol (GHG Protocol) is the most widely used international accounting tool to understand, quantify, and manage greenhouse gas emissions. To the extent possible, calculations should leverage GHG Protocol guidelines and methodologies. In some contexts, this metric can serve as an indicator of whether the outcome being sought by an investor or organization is occurring (the WHAT dimension of impact). For more on the alignment of IRIS metrics to the five dimensions of impact, see IRIS+ and the Five Dimensions of Impact (https://iris.thegiin.org/document/iris-and-the-five-dimensions/). No single metric is sufficient to understand an impact; rather, metrics are selected as a set across all dimensions of impact. When possible, the selection of metrics to measure and describe the five dimensions should be based on best practice and evidence.
defined by: giin

Client Individuals: Low Income
type: Concept
type: Code
has name: Client Individuals: Low Income
has description: Number of unique low-income individuals who were clients of the organization during the reporting period.
definition: Number of unique low-income individuals who were clients of the organization during the reporting period.
has identifier: PI7098
notation: PI7098
had primary source: PI7098
note: Organizations should footnote all assumptions used, including source of data, as well as details of the assessment tools used to identify low-income clients. See usage guidance for further information.
scope note: This metric is intended to capture the number of unique low-income clients who received the organization's products or services during the reporting period. It is not a measure of foot traffic, nor is it intended to capture the number of consumer transactions. For example, a customer who makes two purchases during a period should be counted only once. Organizations wishing to report on total client transactions should refer to Client Transactions (PI5184). The population classified as low income includes all those who fall below a fixed threshold, which includes those classified as poor or very poor. Because assessing the poverty level of stakeholders is complex, organizations will likely use specific assessment tools to accurately report on this metric. See the glossary definition for additional information on commonly used tools to help determine the absolute poverty level of individuals and households. This metric is intended to capture the unique number of specific individuals served. Organizations should not use any household multipliers when reporting against this metric. If organizations consider entire households to be the customer/client, they can report against Client Households: Total (PI7954) and its associated submetrics. Many organizations may not be able to report on the number of clients using direct data. For example, organizations that sell solar lanterns through a series of local network distributors might estimate the number of client individuals reached based on the number of units sold. Organizations should footnote details on how and why these assumptions were made. For healthcare providers, “client individuals” refers to patients. For housing providers, “client individuals” refers to residents or tenants. This metric is multi-dimensional with regard to the five dimensions of impact. It may help describe the WHO dimension when the stakeholder group represented by the metric is the stakeholder group targeted by the investment or organization. I…
defined by: giin

Target Stakeholder Injuries
type: Concept
type: Code
has name: Target Stakeholder Injuries
has description: Number of injuries of the organization's target stakeholders during the reporting period.
definition: Number of injuries of the organization's target stakeholders during the reporting period.
has identifier: PI7161
notation: PI7161
had primary source: PI7161
note: Organizations should footnote all assumptions used.
scope note: This metric is intended to capture the number of injuries that result from accidents on or around projects financed by the organization during the reporting period. For example, in the context of road infrastructure investments, this metric would cover injuries sustained as a result of traffic accidents on roads financed or products/vehicles sold by the organization during the reporting period. If the same target stakeholder experiences more than one injury during the reporting period, each instance of injury should be counted separately. That is, an individual injured twice during the reporting period would count as two injuries. This metric is often used by International Finance Institutions (IFIs) as part of transportation analysis. This metric may help describe the HOW MUCH Scale dimension, which helps estimate the number of the targeted stakeholders experiencing the outcome. For more on the alignment of IRIS metrics to the five dimensions of impact, see IRIS+ and the Five Dimensions of Impact (https://iris.thegiin.org/document/iris-and-the-five-dimensions/). No single metric is sufficient to understand an impact; rather, metrics are selected as a set across all dimensions of impact. The selection of metrics to measure and describe the five dimensions should be based on best practice and evidence.
defined by: giin

Target Stakeholder Satisfaction Ratio
type: Concept
type: Code
has name: Target Stakeholder Satisfaction Ratio
has description: Score reflecting the percentage of the organization’s target stakeholders who are likely to recommend the organization’s product or service as of the end of the reporting period, compared with the percentage who are unlikely to recommend it.
definition: Score reflecting the percentage of the organization’s target stakeholders who are likely to recommend the organization’s product or service as of the end of the reporting period, compared with the percentage who are unlikely to recommend it.
has identifier: PI7163
notation: PI7163
had primary source: PI7163
note: Organizations should footnote all assumptions used. Organizations should also note how data was collected. See usage guidance for further information.
scope note: This metric is intended to capture a proxy measure of product/service quality and target stakeholder satisfaction. A target stakeholder can be a client, employee, or anyone the organization is aiming to have a positive impact on, and is called a "beneficiary" by some organizations. This metric can also be understood as a Net Promoter Score. For further information and guidance on this calculation, see NetPromoter.com. Organizations can use the question "How likely is it that you would recommend \[product/service\] to a friend or colleague?" to collect data from target stakeholders against this metric. Respondents should rank their likelihood to recommend on a 0-10 scale, with 0 representing "not at all likely to recommend," 10 representing "extremely likely to recommend,"and 5 representing "neutral." Target stakeholders ranking themselves as a 9 or 10 are considered "extremely likely" or "Promoters." Target stakeholders ranking themselves as a 7 or 8 are considered "Passives." Target stakeholders ranking themselves as 0-6 are considered "unlikely" or "Detractors." Users may report this metric with Client Feedback System (OI5049) as the system by which this feedback is solicited. In specific contexts, and based on evidence, this metric may serve as a proxy indicator of whether the outcome being sought by an investor or organization is occurring (the WHAT dimension of impact). For more on the alignment of IRIS metrics to the five dimensions of impact, see specific guidance document. No single metric is sufficient to understand an impact; rather, metrics are selected as a set across all dimensions of impact. When possible, the selection of metrics to measure and describe the five dimensions should be based on best practice and evidence.
defined by: giin

Area of Fresh Water Bodies Present
type: Concept
type: Code
has name: Area of Fresh Water Bodies Present
has description: Surface area of freshwater bodies present during the reporting period on protected land, land under sustainable stewardship, or land under sustainable cultivation.
definition: Surface area of freshwater bodies present during the reporting period on protected land, land under sustainable stewardship, or land under sustainable cultivation.
has identifier: PI7170
notation: PI7170
had primary source: PI7170
note: Organizations should footnote all assumptions used.
scope note: This metric is intended to capture the area of freshwater bodies the organization is working to protect. Organizations are encouraged to report this metric in conjunction with Land Directly Controlled: Sustainably Managed (OI6912), Land Indirectly Controlled: Sustainably Managed (PI6796), and Protected Land Area (PI4716).
defined by: giin

Healthcare Effective Coverage
type: Concept
type: Code
has name: Healthcare Effective Coverage
has description: Percentage of the organization's clients (patients) who received necessary health intervention(s) during the reporting period.
definition: Percentage of the organization's clients (patients) who received necessary health intervention(s) during the reporting period.
has identifier: PI7191
notation: PI7191
had primary source: PI7191
note: Organizations should footnote the expected time frame and clinical protocols that define a completed treatment, in addition to all other assumptions used. See usage guidance for further information.
scope note: This metric is intended to capture the proportion of patients that are eligible for an intervention that receive that intervention and then go on to benefit from it. For a detailed explanation of this measure, see “Effective Coverage: A Metric for Monitoring Universal Health Coverage” (https://www.ncbi.nlm.nih.gov/pmc/articles/PMC4171091/#:~:text=Effective%20coverage%2C%20which%20unites%20individual,tracking%20progress%20towards%20achieving%20UHC). Healthcare Crude Coverage (PI3902) is an input into Healthcare Effective Coverage (PI7191) – crude coverage is a simple measure of percent of patients needing treatment who received it during the reporting period, while effective coverage includes a measure of quality. Both can be applied at a national, individual, or organizational level; investors are encouraged to apply them at the level of the investee company. While crude coverage is more widely used, experts are increasingly encouraging use of the quality-inclusive effective coverage measure. However, there are not, as of yet, broadly standardized ratios for the “quality of the intervention” element of the calculation. IRIS users are encouraged to document all assumptions used in calculating this measure as well as to use existing publications such as the following to inform their approaches: - IADB’s "The Use of Effective Coverage in the Evaluation of Maternal and Child Health Programs: A Technical Note for the IDB’s Social Protection and Health” (https://publications.iadb.org/publications/english/document/The-Use-of-Effective-Coverage-in-the-Evaluation-of-Maternal-and-Child-Health-Programs-A-Technical-Note-for-the-IDB-Social-Protection-and-Health-Division.pdf) - “Effective coverage as a new approach to health system performance assessment: a scoping review” (https://bmchealthservres.biomedcentral.com/articles/10.1186/s12913-018-3692-7#:~:text=In%20their%20work%2C%20effective%20coverage%20combines%20three%20widely,which%20is%20actually%20delivered%20%5B%201%2C%2010…
defined by: giin

Value of Housing Units Financed
type: Concept
type: Code
has name: Value of Housing Units Financed
has description: Value of housing projected to be constructed or preserved as a result of investments made by the organization during the reporting period.
definition: Value of housing projected to be constructed or preserved as a result of investments made by the organization during the reporting period.
has identifier: PI7233
notation: PI7233
had primary source: PI7233
note: Organizations should footnote all assumptions used.
scope note: This metric is intended to capture the value of investments made to construct new housing units or preserve existing housing units, not the value of the actual housing units themselves. Organizations should report housing units in both single- and multi-family buildings.
defined by: giin

School Enrollment: Poor
type: Concept
type: Code
has name: School Enrollment: Poor
has description: Number of poor students enrolled as of the end of the reporting period, both full- and part-time, with each discrete student counted once regardless of their number of courses.
definition: Number of poor students enrolled as of the end of the reporting period, both full- and part-time, with each discrete student counted once regardless of their number of courses.
has identifier: PI7254
notation: PI7254
had primary source: PI7254
note: Organizations should footnote all assumptions used, including details on the assessment tools used to identify the poverty level of students. Organizations should also break down enrolled poor students into full- and part-time. See usage guidance for further information.
scope note: This metric is intended to capture the number of students from poor backgrounds enrolled at the school as of the end of the reporting period, including both full- and part-time students. Each discrete student should be counted once, regardless of number of courses taken. These data may be most effectively collected through either school reporting (for private schools) or government reporting (for public schools). Because assessing the poverty level of stakeholders is complex, organizations will likely have to use specific assessment tools to accurately report on this metric. See the glossary definition for additional information on commonly used tools to help determine the absolute poverty level of individuals and households. This metric is multi-dimensional with regard to the five dimensions of impact. It may help describe the WHO dimension when the stakeholder group represented by the metric is the stakeholder group targeted by the investment or organization. It may also help measure the HOW MUCH Scale dimension, which helps estimate the number of the targeted stakeholders experiencing the outcome. For more on the alignment of IRIS metrics to the five dimensions of impact, see IRIS+ and the Five Dimensions of Impact (https://iris.thegiin.org/document/iris-and-the-five-dimensions/). No single metric is sufficient to understand an impact; rather, metrics are selected as a set across all dimensions of impact. When possible, the selection of metrics to measure and describe the five dimensions should be based on best practice and evidence.
defined by: giin

Classroom Space New/Improved
type: Concept
type: Code
has name: Classroom Space New/Improved
has description: Area of classroom space built, converted, or expanded for use within educational facilities during the reporting period. Report only space completed during the reporting period.
definition: Area of classroom space built, converted, or expanded for use within educational facilities during the reporting period. Report only space completed during the reporting period.
has identifier: PI7268
notation: PI7268
had primary source: PI7268
note: Organizations should footnote all assumptions used, as well as details on the intended use of the completed new/improved classroom space completed.
scope note: This metric is intended to capture investment during the reporting period into educational facilities in terms of added or improved learning space.
defined by: giin

Units/Volume Sold: Certified
type: Concept
type: Code
has name: Units/Volume Sold: Certified
has description: Amount of the product/service sold by the organization as certified during the reporting period.
definition: Amount of the product/service sold by the organization as certified during the reporting period.
has identifier: PI7289
notation: PI7289
had primary source: PI7289
note: Organizations should footnote all assumptions used, including details about the applicable certification. See usage guidance for further information.
scope note: A certification must come from a third party, be based on transparent standards, and have an assurance process. The process of certification must be carried out by a recognized third-party body, independent from interested parties, which demonstrates that a product or organization complies with the requirements defined by the standards or technical specifications. Examples of such certifications include: UTZ Certified, Fair Trade (WFTO fair trade standard), Common Code for the Coffee Community (C4), Rainforest Alliance agriculture certification, Marine Stewardship Council (MSC), and the Forest Stewardship Council (FSC). Organizations should footnote relevant details about the certification (such as certification name and certifying body) and can do so by reporting separately on Product/Service Certifications (PD2756). Organizations that sell different types of products/services should consider reporting separately against each different product/service.
defined by: giin

Client Households: Low Income
type: Concept
type: Code
has name: Client Households: Low Income
has description: Number of unique low-income households that were clients of the organization during the reporting period.
definition: Number of unique low-income households that were clients of the organization during the reporting period.
has identifier: PI7318
notation: PI7318
had primary source: PI7318
note: Organizations should footnote all assumptions used, including source of data, as well as details on the assessment tools used to identify low-income households. See usage guidance for further information.
scope note: This metric is intended to capture the number of unique low-income households that received the organization’s products or services during the reporting period. Examples of organizations that might report against this metric include those that provide products such as clean cookstoves or water purification systems and those that provide services such as home weatherization. Organizations that provide goods and services at the individual level, such as vaccines or school lunches, may find it more appropriate to report against Client Individuals: Total (PI4060) and related submetrics. The population classified as low income includes all those who fall below a fixed threshold, which includes those classified as poor or very poor. Because assessing the poverty level of clients is complex, organizations will likely use specific assessment tools to accurately report on this metric. See the glossary definition for additional information on commonly used tools to help determine the absolute poverty level of individuals and households. Many organizations may not be able to report on the number of client households using direct data. For example, organizations that sell water purification systems through a series of local network distributors might estimate the number of client households reached based on the number of units sold. Organizations should footnote details on how and why these assumptions were made. This metric is multi-dimensional with regard to the five dimensions of impact. It may help describe the WHO dimension when the stakeholder group represented by the metric is the stakeholder group targeted by the investment or organization. It may also help measure the HOW MUCH Scale dimension, which helps estimate the number of the targeted stakeholders experiencing the outcome. For more on the alignment of IRIS metrics to the five dimensions of impact, see IRIS+ and the Five Dimensions of Impact (https://iris.thegiin.org/document/iris-and-the-five-dimensions/). No sin…
defined by: giin

Sales Revenue: Certified
type: Concept
type: Code
has name: Sales Revenue: Certified
has description: Value of revenue received from sales of the organization’s certified products during the reporting period.
definition: Value of revenue received from sales of the organization’s certified products during the reporting period.
has identifier: PI7321
notation: PI7321
had primary source: PI7321
note: Organizations should footnote all assumptions used, including details about the applicable certification. See usage guidance for further information.
scope note: This metric is intended to capture the amount of the organization’s sales revenue that comes from selling certified products. A certification must come from a third party, be based on transparent standards, and have an assurance process. The process of certification must be carried out by a recognized third-party body, independent from interested parties, which demonstrates that a product or organization complies with the requirements defined by the standards or technical specifications. Examples of such certifications include UTZ Certified, Fair Trade (WFTO fair trade standard), Common Code for the Coffee Community (C4), Rainforest Alliance agriculture certification, Marine Stewardship Council (MSC), and the Forest Stewardship Council (FSC). Organizations should footnote relevant details about the certification (such as certification name and certifying body) and can do so by reporting separately on Product/Service Certifications (PD2756).
defined by: giin

Target Stakeholder Spending: Health
type: Concept
type: Code
has name: Target Stakeholder Spending: Health
has identifier: PI7395
notation: PI7395
had primary source: PI7395
note: Organizations should footnote all assumptions used, including source of data.
scope note: This metric is intended to disaggregate the number of Client Households: Total (PI7954) according to the proportion of their total household expenditure or income spent on health during the reporting period. These data can be collected directly from target stakeholders (patients) or through the healthcare service/facility. If collected directly from target stakeholders through a survey, organizations should footnote details on the sample size and survey instrument used, as well as details on who administered the survey and who aggregated the resulting data. Third party data may also be available; see Sustainable Development Goal indicator reference below. This metric, in combination with Client Households: Total (PI7954) aligns with Sustainable Development Goal (SDG) indicator 3.8.2. This SDG indicator offers two "levels" of what constitutes a large share of household expenditure; the options within this disaggregation metric align with those two thresholds. IRIS+ users are encouraged to calculate both. For further guidance, see SDG indicator metadata for indicator 3.8.2 (https://unstats.un.org/sdgs/metadata/files/Metadata-03-08-02.pdf). In some contexts, this metric can serve as an indicator of whether the outcome being sought by an investor or organization is occurring (the WHAT dimension of impact). For more on the alignment of IRIS metrics to the five dimensions of impact, see IRIS+ and the Five Dimensions of Impact (https://iris.thegiin.org/document/iris-and-the-five-dimensions/). No single metric is sufficient to understand an impact; rather, metrics are selected as a set across all dimensions of impact. When possible, the selection of metrics to measure and describe the five dimensions should be based on best practice and evidence.
has description: Describes a target stakeholder's health spending as a share of their income or expenditures, or disaggregates another metric in terms of health spending as a share of income or expenditures. Select one: - Below 10% - 10–25% - Greater than 25%
definition: Describes a target stakeholder's health spending as a share of their income or expenditures, or disaggregates another metric in terms of health spending as a share of income or expenditures. Select one: - Below 10% - 10–25 - Greater than 25%
defined by: giin

Land Indirectly Controlled: Cultivated
type: Concept
type: Code
has name: Land Indirectly Controlled: Cultivated
has description: Area of land indirectly controlled by the organization and under cultivation. Report indirectly controlled land area cultivated during the reporting period.
definition: Area of land indirectly controlled by the organization and under cultivation. Report indirectly controlled land area cultivated during the reporting period.
has identifier: PI7403
notation: PI7403
had primary source: PI7403
note: Organizations should footnote details about the nature of the indirect control relationship and all assumptions used, including source of data. See usage guidance for further information.
scope note: The IRIS catalog differentiates between land that the organization directly controls and land that the organization indirectly controls. This metric is intended to capture the area of land that is under the organization's indirect control. Indirect control refers to land that the organization supports or influences but does not directly cultivate or manage. Examples in which an organization indirectly controls land may include purchase contracts or sourcing from farmer cooperatives. Organizations that exert control over land practices of indirectly controlled land should footnote these details (for example, when an organization specifies that farmers adhere to specific environmental practices). This metric includes crops cultivated through low-till and no-till methods.
defined by: giin

Effective Interest Rate (EIR)
type: Concept
type: Code
has name: Effective Interest Rate (EIR)
has description: Value of the effective interest rate (EIR) for the organization’s most representative loan product during the reporting period.
definition: Value of the effective interest rate (EIR) for the organization’s most representative loan product during the reporting period.
has identifier: PI7467
notation: PI7467
had primary source: PI7467
note: Organizations should footnote all assumptions used.
scope note: This metric is intended to capture the effective interest rate (EIR), a figure that converts all financial costs to the borrower for a loan into a single declining-balance interest calculation. It includes the effects of interest rates (whether calculated on a flat or declining basis), payment schedules, commissions, fees, discounting, and compensating balances. For guidance on calculating EIR, organizations should refer to the tool created by the MFTransparency Organization (http://www.mftransparency.org/pages/ctp-tool/).
defined by: giin

Value of Loans Outstanding
type: Concept
type: Code
has name: Value of Loans Outstanding
has description: Value of disbursed loans remaining on the organization's balance sheet at the end of the reporting period.
definition: Value of disbursed loans remaining on the organization's balance sheet at the end of the reporting period.
has identifier: PI7569
notation: PI7569
had primary source: PI7569
note: Organizations should footnote all assumptions used.
scope note: This metric is intended to capture the principal value of loans on the organization’s balance sheet as of the end of the reporting period. Organizations should report the total principal value of all loans disbursed to clients that have been neither fully repaid nor written off, but they should not include accrued interest. For financial organizations, loans disbursed are considered Financial Assets (FP4649) listed on the organization's balance sheet.
defined by: giin

Energy Savings from Products Sold
type: Concept
type: Code
has name: Energy Savings from Products Sold
has description: Amount of energy savings over the lifetime of products sold by the organization during the reporting period.
definition: Amount of energy savings over the lifetime of products sold by the organization during the reporting period.
has identifier: PI7623
notation: PI7623
had primary source: PI7623
note: Organizations should footnote all assumptions used.
scope note: This metric is intended to capture the product-lifetime energy savings to consumers as a result of energy-efficient products sold by the organization. For example, an organization that sells compact fluorescent light bulbs (CFLs) that replace incandescent light bulbs might report this metric to capture the total energy savings to its clients resulting from the products provided. This metric captures the lifetime energy savings of products sold. When multiplying the energy savings from each product sold by Units/Volume Sold: Total (PI1263), organizations should, under Units/Volume Sold: Total (PI1263), use the absolute number of product units sold rather than the volume of energy savings delivered by the product. In some contexts, this metric can serve as an indicator of whether the outcome being sought by an investor or organization is occurring (the WHAT dimension of impact). For more on the alignment of IRIS metrics to the five dimensions of impact, see IRIS+ and the Five Dimensions of Impact (https://iris.thegiin.org/document/iris-and-the-five-dimensions/). No single metric is sufficient to understand an impact; rather, metrics are selected as a set across all dimensions of impact. When possible, the selection of metrics to measure and describe the five dimensions should be based on best practice and evidence.
defined by: giin

Purchase Price of Product or Service Sold
type: Concept
type: Code
has name: Purchase Price of Product or Service Sold
has description: Value of the purchase price paid by clients for a product or service sold by the organization.
definition: Value of the purchase price paid by clients for a product or service sold by the organization.
has identifier: PI7643
notation: PI7643
had primary source: PI7643
note: Organizations should footnote all assumptions used.
scope note: This metric is intended to capture the price of a product or service sold by the organization as of the end of the reporting period. Organizations may consider reporting this metric along with Client Savings Premium (PI1748) to capture client savings from purchase of the organization’s product or service.
defined by: giin

Species: Total
type: Concept
type: Code
has name: Species: Total
has description: Indicates the number of different species (species richness) present within the area managed directly or indirectly by the organization as of the end of the reporting period.
definition: Indicates the number of different species (species richness) present within the area managed directly or indirectly by the organization as of the end of the reporting period.
has identifier: PI7728
notation: PI7728
had primary source: PI7728
note: Organizations should footnote all assumptions used, including source of data.
scope note: This metric is intended to capture the richness of species in an area managed directly or indirectly by the organization. For aquatic biodiversity, the Ocean Data Viewer by Ocean+ (see https://data.unep-wcmc.org/ and https://oceanplus.org/) includes various spatial datasets, such as the distribution of coral reefs, mangroves, and seagrasses. Organizations may find emerging methods such as e-DNA and bioacoustics particularly useful for this measure – while data analysis requires specialized training, data collection can be done at the project level by laypersons. This metric may be used in combination with Species Conservation Status (PD6429) to quantify the number of species present that are in threatened, endangered, and other conservation statuses. See Species Conservation Status (PD6429) for further information and data sources. Organizations are encouraged, albeit with caution, to embrace innovative measurement approaches to improve accuracy of this measure. Interesting work to standardize data and measurement approaches is available from: -European Business & Biodiversity Platform’s workstreams on methods (https://ec.europa.eu/environment/biodiversity/business/workstreams/methods/index_en.htm) -WWF (2021, https://wwfint.awsassets.panda.org/downloads/wwf_assessing_portfolio_impacts_final.pdf) • Pioneers (with an explicit focus on the financial sector). Investors are strongly encouraged to contextualize their projects – and ideally select projects – based on broader, country- or region-level biodiversity and landscape assessments focused on site irreplaceability. Viewing biodiversity through the lens of a systematic conservation plan enables more efficient, impact goal-oriented management decisions.
defined by: giin

School Enrollment: Historically Marginalized
type: Concept
type: Code
has name: School Enrollment: Historically Marginalized
has description: Number of students who belong to groups historically marginalized due to race and/or ethnicity and who are enrolled as of the end of the reporting period, both full- and part-time, with each discrete student counted once regardless of their number of courses.
definition: Number of students who belong to groups historically marginalized due to race and/or ethnicity and who are enrolled as of the end of the reporting period, both full- and part-time, with each discrete student counted once regardless of their number of courses.
has identifier: PI7774
notation: PI7774
had primary source: PI7774
note: Organizations should footnote all assumptions used, including their categorization of historically marginalized groups. Organizations should also break down enrolled students into full- and part-time. See usage guidance for further information.
scope note: This metric is intended to capture the number of students from historically marginalized due to race and/or ethnicity groups enrolled at the school as of the end of the reporting period, including both full- and part-time students. Each discrete student should be counted once, regardless of number of courses taken. These data may be most effectively collected through either school reporting (for private schools) or government reporting (for public schools). The categorization of historically marginalized groups varies with location and context. With no internationally agreed-upon definition as to which groups constitute historically marginalized due to race and/or ethnicity, if well-established local policies exist (as in South Africa, with the Broad Based Black Economic Empowerment [BBBEE] definition of historically marginalized, or in India, based on backward caste), organizations should refer to these local guidelines to identify groups historically marginalized due to race and/or ethnicity. Otherwise, and wherever appropriate, organizations should provide additional detail regarding their tailored methodology for defining these groups. This metric is multi-dimensional with regard to the five dimensions of impact. It may help describe the WHO dimension when the stakeholder group represented by the metric is the stakeholder group targeted by the investment or organization. It may also help measure the HOW MUCH Scale dimension, which helps estimate the number of the targeted stakeholders experiencing the outcome. For more on the alignment of IRIS metrics to the five dimensions of impact, see IRIS+ and the Five Dimensions of Impact (https://iris.thegiin.org/document/iris-and-the-five-dimensions/). No single metric is sufficient to understand an impact; rather, metrics are selected as a set across all dimensions of impact. When possible, the selection of metrics to measure and describe the five dimensions should be based on best practice and evidence.
defined by: giin

Payments to Supplier Individuals: Historically Marginalized
type: Concept
type: Code
has name: Payments to Supplier Individuals: Historically Marginalized
has description: Value of payments made by the organization to individuals who belong to groups historically marginalized on the basis of race and/or ethnicity and who sold goods or services to the organization during the reporting period.
definition: Value of payments made by the organization to individuals who belong to groups historically marginalized on the basis of race and/or ethnicity and who sold goods or services to the organization during the reporting period.
has identifier: PI7814
notation: PI7814
had primary source: PI7814
note: Organizations should footnote all assumptions used, including their categorization of historically marginalized groups. See usage guidance for further information.
scope note: This metric is intended to capture how organizations support the livelihoods of individuals who belong to groups historically marginalized on the basis of race and/or ethnicity through their supply chains. The categorization of historically marginalized groups varies with location and context. With no internationally agreed-upon definition as to which groups constitute historically marginalized on the basis of race and/or ethnicity, if well-established local policies exist (as in South Africa, with the Broad Based Black Economic Empowerment [BBBEE] definition of historically marginalized, or in India, based on backward caste), organizations should refer to these local guidelines to identify groups historically marginalized on the basis of race and/or ethnicity. Otherwise, and wherever appropriate, organizations should provide additional detail regarding their tailored methodology for defining these groups.
defined by: giin

Payments to Supplier Individuals: Poor
type: Concept
type: Code
has name: Payments to Supplier Individuals: Poor
has description: Value of payments made by the organization to poor individuals who sold goods or services to the organization during the reporting period.
definition: Value of payments made by the organization to poor individuals who sold goods or services to the organization during the reporting period.
has identifier: PI7815
notation: PI7815
had primary source: PI7815
note: Organizations should footnote all assumptions used, including details on the assessment tools used to identify the poverty level of suppliers. See usage guidance for further information.
scope note: This metric is intended to capture how organizations support the livelihoods of individuals living in poverty through their supply chains. Because assessing the poverty level of stakeholders is complex, organizations will likely have to use specific assessment tools to accurately report on this metric. See the glossary definition for additional information on commonly used tools to help determine the absolute poverty level of individuals and households.
defined by: giin

Product/Service Warranty
type: Concept
type: Code
has name: Product/Service Warranty
has description: Indicates whether the organization provides a warranty for its product or service.
definition: Indicates whether the organization provides a warranty for its product or service.
has identifier: PI7834
notation: PI7834
had primary source: PI7834
note: Organizations should footnote details of the length of time for which the warranty is valid, what it covers, and how it is communicated to clients. See usage guidance for more information.
scope note: This metric is intended to capture whether or not a product or service carries a warranty. Organizations should report this metric separately for each product/service. A warranty is a type of guarantee that an organization makes regarding the condition of its product or effectiveness of its service. It also refers to the terms by and situations in which repairs or exchanges will be made in the event that the product/service does not function as originally described or intended. Warranties will likely describe for how long the warranty is valid, the point of contact for receiving the warranty service, the service provided upon receiving the warranty (e.g., product replacement), what the warranty does and does not cover, and any conditions and limitations of the warranty.
defined by: giin

Payments to Supplier Individuals: Smallholder
type: Concept
type: Code
has name: Payments to Supplier Individuals: Smallholder
has description: Value of payments made to smallholder farmer individuals who sold to the organization during the reporting period.
definition: Value of payments made to smallholder farmer individuals who sold to the organization during the reporting period.
has identifier: PI7852
notation: PI7852
had primary source: PI7852
note: Organizations should footnote all assumptions used, including source of data.
scope note: This metric is intended to capture total value paid to smallholder suppliers of the organization during the reporting period. This metric is intended for use by organizations that seek to support smallholder farmer individuals through their supply chains.
defined by: giin

Payments to Supplier Organizations: SME
type: Concept
type: Code
has name: Payments to Supplier Organizations: SME
has description: Value of payments to small and medium-sized enterprises (SMEs) that sold goods or services to the organization during the reporting period.
definition: Value of payments to small and medium-sized enterprises (SMEs) that sold goods or services to the organization during the reporting period.
has identifier: PI7867
notation: PI7867
had primary source: PI7867
note: Organizations should footnote all assumptions used.
scope note: This metric is intended to capture the value of payments made during the reporting period to small and medium-sized enterprises that supply goods or services to the reporting organization. Organizations can themselves determine the precise threshold at which they report suppliers. In most cases, organizations should include only those enterprises supplying goods and services that are fundamental to the operations of the reporting organization. Organizations should not include subcontractors as part of this metric; subcontractors can be reported under Temporary Employees (OI9028) and its related submetrics.
defined by: giin

Client Organizations Founded: Total
type: Concept
type: Code
has name: Client Organizations Founded: Total
has description: Number of client organizations as of the end of the reporting period in which half or more of the lead founder(s) represent a specific group (for example, women).
definition: Number of client organizations as of the end of the reporting period in which half or more of the lead founder(s) represent a specific group (for example, women).
has identifier: PI7869
notation: PI7869
had primary source: PI7869
note: Organizations should footnote all assumptions used, including source of data. Organizations should also footnote the types of enterprises that were clients, using Client Type (PD7993).
scope note: This metric is intended to capture the number of client organizations founded by individuals representing a particular group through use in combination with Target Stakeholder Demographic (PD5752) to first define the group of interest (for example, women, historically marginalized or excluded groups, or persons with disabilities). Then, this metric can be used to capture the number of investee companies within a portfolio who were founded by that group. Founder(s) counted must retain an active role in the organization as of the end of the reporting period. An active role may include acting in an advisory capacity for key decisions. It need not necessarily require a full-time role at the organization. Client organizations are synonymous with investees for impact investors. If using this metric to capture the number of women-founded investees, practitioners may refer to specific gender benchmarks and application guidance as needed, such as those specified by the 2X Challenge (www.2xchallenge.org). This metric may help describe the HOW MUCH Scale dimension, which helps estimate the number of the targeted stakeholders experiencing the outcome. For more on the alignment of IRIS metrics to the five dimensions of impact, see IRIS+ and the Five Dimensions of Impact (https://iris.thegiin.org/document/iris-and-the-five-dimensions/). No single metric is sufficient to understand an impact; rather, metrics are selected as a set across all dimensions of impact. The selection of metrics to measure and describe the five dimensions should be based on best practice and evidence.
defined by: giin

Teaching Experience
type: Concept
type: Code
has name: Teaching Experience
has description: Average number of years of formal education for teachers and instructors as of the end of the reporting period.
definition: Average number of years of formal education for teachers and instructors as of the end of the reporting period.
has identifier: PI7871
notation: PI7871
had primary source: PI7871
note: Organizations should footnote all assumptions used, including details on how years of teaching experience are tracked.
scope note: This metric is intended to capture the efficiency of teachers employed by the school as a proxy for the quality of education provided. Studies have shown that experience has the strongest impact over the first few years of teaching, after which marginal returns diminish. Research also shows that high-poverty schools tend to have a greater proportion of teachers with fewer than three years of experience.
defined by: giin

Claims Rejection Ratio
type: Concept
type: Code
has name: Claims Rejection Ratio
has description: Percentage of claims made by clients of the organization that were rejected during the reporting period relative to the total claims submitted to the organization during the reporting period.
definition: Percentage of claims made by clients of the organization that were rejected during the reporting period relative to the total claims submitted to the organization during the reporting period.
has identifier: PI7902
notation: PI7902
had primary source: PI7902
note: Organizations should footnote all assumptions used.
scope note: This metric is intended to capture the percentage of claims rejected by the organization during the reporting period. This metric is applicable to organizations in the insurance industry and can be used to examine the proportion of claims that were disqualified for benefit payment (rejected) for whatever reason. As an example, a 10% claims rejection ratio means that for every 100 claims reported, 90 result in a benefit payment while the other 10 are denied. For more detail on the ratio and for guidance on interpretation, see the Microinsurance Network's Social Performance Indicators for Microinsurance, p. 25 (https://www.social-protection.org/gimi/ShowRessource.action?id=5270/).
defined by: giin

Units/Volume Purchased from Supplier Individuals: Total
type: Concept
type: Code
has name: Units/Volume Purchased from Supplier Individuals: Total
has description: Units/volume from individuals who sold to the reporting organization during the reporting period.
definition: Units/volume from individuals who sold to the reporting organization during the reporting period.
has identifier: PI7923
notation: PI7923
had primary source: PI7923
note: Organizations should footnote all assumptions used, including source of data.
scope note: This metric is intended to capture the total units or volume an organization purchased during the reporting period from suppliers who are individuals. Organizations that purchase different types of products/services should consider reporting separately against each different type of product/service. Organizations may wish to use this metric in conjunction with Supplier Individuals: Total (PI5350).
defined by: giin

Value of Equity Investments Outstanding
type: Concept
type: Code
has name: Value of Equity Investments Outstanding
has description: Value of equity investments on the organization's balance sheet at the end of the reporting period.
definition: Value of equity investments on the organization's balance sheet at the end of the reporting period.
has identifier: PI7940
notation: PI7940
had primary source: PI7940
note: Organizations should footnote all assumptions used. See usage guidance for further information.
scope note: This metric is intended to capture the value of disbursed equity investments on the organization’s balance sheet as of the end of the reporting period. In an equity investment, in exchange for investment funds, the organization receives an ownership interest in the equity (stock) of the enterprise, either common or preferred stock. Values should be reported at book value for non-traded equities and at market rate for marketable securities. Organizations are encouraged to footnote whether their equity is held directly in enterprises or through funds.
defined by: giin

Client Households: Peri-urban
type: Concept
type: Code
has name: Client Households: Peri-urban
has description: Number of unique households in peri-urban areas that were clients of the organization during the reporting period.
definition: Number of unique households in peri-urban areas that were clients of the organization during the reporting period.
has identifier: PI7952
notation: PI7952
had primary source: PI7952
note: Organizations should footnote all assumptions used, including source of data. See usage guidance for further information.
scope note: This metric is intended to capture the number of unique peri-urban households that received the organization's products or services during the reporting period. Examples of organizations that might report against this metric include those that provide products such as clean cookstoves or water purification systems and those that provide services such as home weatherization. Organizations that provide goods and services at the individual level, such as vaccines or school lunches, may find it more appropriate to report against Client Individuals: Total (PI4060) and related submetrics. Many organizations may not be able to report on the number of client households using direct data. For example, organizations that sell water purification systems through a series of local network distributors might estimate the number of client households reached based on the number of units sold. Organizations should footnote details on how and why these assumptions were made. This metric is multi-dimensional with regard to the five dimensions of impact. It may help describe the WHO dimension when the stakeholder group represented by the metric is the stakeholder group targeted by the investment or organization. It may also help measure the HOW MUCH Scale dimension, which helps estimate the number of the targeted stakeholders experiencing the outcome. For more on the alignment of IRIS metrics to the five dimensions of impact, see IRIS+ and the Five Dimensions of Impact (https://iris.thegiin.org/document/iris-and-the-five-dimensions/). No single metric is sufficient to understand an impact; rather, metrics are selected as a set across all dimensions of impact. When possible, the selection of metrics to measure and describe the five dimensions should be based on best practice and evidence.
defined by: giin

Client Households: Total
type: Concept
type: Code
has name: Client Households: Total
has description: Number of unique households that were clients of the organization during the reporting period.
definition: Number of unique households that were clients of the organization during the reporting period.
has identifier: PI7954
notation: PI7954
had primary source: PI7954
note: Organizations should footnote all assumptions used, including source of data. See usage guidance for further information.
scope note: This metric is intended to capture the number of unique households that received the organization’s products or services during the reporting period. Examples of organizations that might report against this metric include those that provide products such as clean cookstoves or water purification systems and those that provide services such as home weatherization. Organizations that provide goods and services at the individual level, such as vaccines or school lunches, may find it more appropriate to report against Client Individuals: Total (PI4060) and related submetrics. Many organizations may not be able to report on the number of client households using direct data. For example, organizations that sell water purification systems through a series of local network distributors might estimate the number of client households reached based on the number of units sold. Organizations should footnote details on how and why these assumptions were made. This metric is multi-dimensional with regard to the five dimensions of impact. It may help describe the WHO dimension when the stakeholder group represented by the metric is the stakeholder group targeted by the investment or organization. It may also help measure the HOW MUCH Scale dimension, which helps estimate the number of the targeted stakeholders experiencing the outcome. For more on the alignment of IRIS metrics to the five dimensions of impact, see IRIS+ and the Five Dimensions of Impact (https://iris.thegiin.org/document/iris-and-the-five-dimensions/). No single metric is sufficient to understand an impact; rather, metrics are selected as a set across all dimensions of impact. When possible, the selection of metrics to measure and describe the five dimensions should be based on best practice and evidence.
defined by: giin

Active Use
type: Concept
type: Code
has name: Active Use
has identifier: PI7985
notation: PI7985
had primary source: PI7985
note: Organizations should footnote all assumptions used, including source of disaggregation and any other disaggregations applied.
scope note: This disaggregation, applied to another metric, is intended to capture the share of that metric which is considered in or participating in active use. For example, for financial institutions (including microfinance institutions), the disaggregation "active" applied to Client Individuals (PI4060) would include the number of individuals who currently have outstanding loan balances with the organization. For those financial institutions offering deposit products, the disaggregation "active" applied to Client Individuals (PI4060) would include the number of individuals who have active deposit accounts with the organization. For those financial institutions offering insurance products, the disaggregation "active" applied to Client Individuals (PI4060) would include those with active insurance policies. Wherever possible, organizations are encouraged to report and disaggregate the number of individuals, rather than the number of active groups or the number of active policies/accounts. The definition of active may vary by offering. For example, for traditional financial services, “active” may include all individuals who have accounts registered in their names for at least six months and who have used their accounts to make transactions within the prior six months. For digital financial services, “active” may include individuals who have had accounts registered in their names for at least three months and who have used their accounts to make transactions within the prior three months.
has description: Disaggregates another metric in terms of active use. For example, Client Individuals (PI4060) disaggregated by this metric, option "active," would yield Active Users in many contexts. See usage guidance for further information. Select one: - Active - Inactive - Data not available - Other (write-in)
definition: Disaggregates another metric in terms of active use. For example, Client Individuals (PI4060) disaggregated by this metric, option "active," would yield Active Users in many contexts. See usage guidance for further information. Select one: - Active - Inactive - Data not available - Other (write-in)
defined by: giin

Individuals Trained: Group-Based Training
type: Concept
type: Code
has name: Individuals Trained: Group-Based Training
has description: Number of individuals who received group-based training from the organization during the reporting period.
definition: Number of individuals who received group-based training from the organization during the reporting period.
has identifier: PI7997
notation: PI7997
had primary source: PI7997
note: Organizations should footnote the type and extent of the group-based training provided, as well as who received the training. See usage guidance for further information.
scope note: This metric is intended to capture the number of individuals who received group-based training services from the organization during the reporting period. Examples could include sessions on enterprise or business development, women’s empowerment, or diversity and inclusion, among other learning topics. Organizations should footnote details on the provided trainings. Training may or may not be restricted to clients of the organization and may be either fee-based or provided for free. Organizations should not include training of an organization’s own employees under this metric, which should instead be captured by Employees Trained (OI4229). This metric may apply to organizations operating in microfinance or agriculture, as well as other sectors in which organizations often provide training to clients and other community members. This metric may help describe the HOW MUCH Scale dimension, which helps estimate the number of the targeted stakeholders experiencing the outcome. For more on the alignment of IRIS metrics to the five dimensions of impact, see IRIS+ and the Five Dimensions of Impact (https://iris.thegiin.org/document/iris-and-the-five-dimensions/). No single metric is sufficient to understand an impact; rather, metrics are selected as a set across all dimensions of impact. When possible, the selection of metrics to measure and describe the five dimensions should be based on best practice and evidence.
defined by: giin

Number of Community Facilities Financed
type: Concept
type: Code
has name: Number of Community Facilities Financed
has description: Number of community facilities projected to be built, renovated, or purchased as a result of investments made by the organization during the reporting period.
definition: Number of community facilities projected to be built, renovated, or purchased as a result of investments made by the organization during the reporting period.
has identifier: PI8007
notation: PI8007
had primary source: PI8007
note: Organizations should footnote all assumptions used.
scope note: This metric is intended to capture the number of community facilities that will be built, renovated, or purchased as a result of investments by the organization during the reporting period. A community facility provides services to the local community. Examples include health and medical clinics, health-treatment facilities, schools, arts and other cultural facilities, daycare facilities (adult and youth), and community sports facilities.
defined by: giin

Claims Submitted
type: Concept
type: Code
has name: Claims Submitted
has description: Number of claims submitted to the organization during the reporting period.
definition: Number of claims submitted to the organization during the reporting period.
has identifier: PI8018
notation: PI8018
had primary source: PI8018
note: Organizations should footnote all assumptions used.
scope note: This metric is intended to capture the total number of claims submitted to the organization during the reporting period, even those that were eventually rejected.
defined by: giin

Earnings of Distributor Organizations: Microenterprises
type: Concept
type: Code
has name: Earnings of Distributor Organizations: Microenterprises
has description: Earnings of microenterprise distributors as a result of selling the organization’s products/services during the reporting period.
definition: Earnings of microenterprise distributors as a result of selling the organization’s products/services during the reporting period.
has identifier: PI8021
notation: PI8021
had primary source: PI8021
note: Organizations should footnote all assumptions used.
scope note: This metric is intended to capture the earnings, during the reporting period, of microenterprises that sell the organization’s products or services, either to other distributors (wholesale) or to end clients (retail). Distributors counted under this metric need not exclusively sell the organization’s products or services.
defined by: giin

Species Abundance
type: Concept
type: Code
has name: Species Abundance
has description: Indicates the number of individuals of a particular species that are present on area directly or indirectly controlled by the organization as of the end of the reporting period.
definition: Indicates the number of individuals of a particular species that are present on area directly or indirectly controlled by the organization as of the end of the reporting period.
has identifier: PI8027
notation: PI8027
had primary source: PI8027
note: Organizations should footnote all assumptions used, including source of data.
scope note: This metric is intended to capture the abundance of species on area directly or indirectly controlled by the organization as of the end of the reporting period. This metric is intended to be used in combination with Species: Total (PI7728), which identifies species, after which individuals within those species can be counted with this metric. For further details and resources on measurement, see the usage guidance in the metric record for Species: Total (PI7728). Species richness refers to the number of species in an area. Species abundance refers to the number of individuals per species. Investors are strongly encouraged to contextualize their projects – and ideally select projects – based on broader, country- or region-level biodiversity and landscape assessments focused on site irreplaceability. Viewing biodiversity through the lens of a systematic conservation plan enables more efficient, impact goal-oriented management decisions.
defined by: giin

Water Provided for Sale: Potable
type: Concept
type: Code
has name: Water Provided for Sale: Potable
has description: Volume of potable water provided and delivered to offtaker(s) during the reporting period.
definition: Volume of potable water provided and delivered to offtaker(s) during the reporting period.
has identifier: PI8043
notation: PI8043
had primary source: PI8043
note: Organizations should footnote all assumptions used.
scope note: This metric is intended to capture the amount of potable water the organization produced or provided for commercial sale and not water produced for its own consumption. Bulk water production is usually sold to a utility. The buyer or purchaser of this water is termed the offtaker. Potable water is safe enough for human consumption or use for domestic purposes, drinking, cooking, and personal hygiene with low risk of immediate or long-term harm. Organizations wishing to report product-level potable water production should use Water Provision Capacity of Products Sold: Potable (PD1403) and Water Provision Capacity of Product: Potable (PD6929).
defined by: giin

Number of Household and Business Connections
type: Concept
type: Code
has name: Number of Household and Business Connections
has description: Number of residential and commercial connections to utilities and services provided by the organization as of the end of the reporting period.
definition: Number of residential and commercial connections to utilities and services provided by the organization as of the end of the reporting period.
has identifier: PI8053
notation: PI8053
had primary source: PI8053
note: Organizations should footnote all assumptions used, including source(s) of data.
scope note: This metric is intended to capture the number of household- and business-level connections to utilities and other services. Organizations should report this metric in conjunction with Connection Type (PD1310) to disaggregate connections in more detail. For example, disaggregating Number of Household or Business Connections (PI8053) by Connection Type (PD1310), option "Piped Water," would yield the number of piped water connections provided by the organization to households or businesses during the reporting period. This metric may help describe the HOW MUCH Scale dimension, which helps estimate the number of the targeted stakeholders experiencing the outcome. For more on the alignment of IRIS metrics to the five dimensions of impact, see IRIS+ and the Five Dimensions of Impact (https://iris.thegiin.org/document/iris-and-the-five-dimensions/). No single metric is sufficient to understand an impact; rather, metrics are selected as a set across all dimensions of impact. When possible, the selection of metrics to measure and describe the five dimensions should be based on best practice and evidence.
defined by: giin

School Enrollment: Urban
type: Concept
type: Code
has name: School Enrollment: Urban
has description: Number of students residing in urban areas enrolled as of the end of the reporting period, both full- and part-time, with each discrete student counted once regardless of their number of courses.
definition: Number of students residing in urban areas enrolled as of the end of the reporting period, both full- and part-time, with each discrete student counted once regardless of their number of courses.
has identifier: PI8069
notation: PI8069
had primary source: PI8069
note: Organizations should footnote all assumptions used, as well as a breakdown of full- and part-time students residing in urban areas.
scope note: This metric is intended to capture the number of students who live in urban environments and who are enrolled at the school as of the end of the reporting period. This metric includes full- and part-time students. Each discrete student is counted once regardless of the number of courses taken. These data may be most effectively collected through either school reporting (for private schools) or government reporting (for public schools). This metric is multi-dimensional with regard to the five dimensions of impact. It may help describe the WHO dimension when the stakeholder group represented by the metric is the stakeholder group targeted by the investment or organization. It may also help measure the HOW MUCH Scale dimension, which helps estimate the number of the targeted stakeholders experiencing the outcome. For more on the alignment of IRIS metrics to the five dimensions of impact, see IRIS+ and the Five Dimensions of Impact (https://iris.thegiin.org/document/iris-and-the-five-dimensions/). No single metric is sufficient to understand an impact; rather, metrics are selected as a set across all dimensions of impact. When possible, the selection of metrics to measure and describe the five dimensions should be based on best practice and evidence.
defined by: giin

Target Stakeholder Fatalities
type: Concept
type: Code
has name: Target Stakeholder Fatalities
has description: Number of fatalities of the organization's target stakeholders during the reporting period.
definition: Number of fatalities of the organization's target stakeholders during the reporting period.
has identifier: PI8145
notation: PI8145
had primary source: PI8145
note: Organizations should footnote details about each fatality, as well as plans on how to prevent similar fatalities in the future.
scope note: This metric is intended to capture the number of fatalities resulting from accidents on or around projects financed by the organization during the reporting period. For example, in the context of road infrastructure investments, this metric would cover fatalities that result from traffic accidents on roads financed or products/vehicles sold by the organization during the reporting period. This metric is often used by International Finance Institutions (IFIs) as part of transportation analysis. This metric may help describe the HOW MUCH Scale dimension, which helps estimate the number of the targeted stakeholders experiencing the outcome. For more on the alignment of IRIS metrics to the five dimensions of impact, see IRIS+ and the Five Dimensions of Impact (https://iris.thegiin.org/document/iris-and-the-five-dimensions/). No single metric is sufficient to understand an impact; rather, metrics are selected as a set across all dimensions of impact. The selection of metrics to measure and describe the five dimensions should be based on best practice and evidence.
defined by: giin

Client Households: Rural
type: Concept
type: Code
has name: Client Households: Rural
has description: Number of unique households in rural areas that were clients of the organization during the reporting period.
definition: Number of unique households in rural areas that were clients of the organization during the reporting period.
has identifier: PI8163
notation: PI8163
had primary source: PI8163
note: Organizations should footnote all assumptions used. See usage guidance for further information.
scope note: This metric is intended to capture the number of unique rural households that received the organization’s products or services during the reporting period. Examples of organizations that might report against this metric include those that provide products such as clean cookstoves or water purification systems and those that provide services such as home weatherization. Organizations that provide goods and services at the individual level, such as vaccines or school lunches, may find it more appropriate to report against Client Individuals: Total (PI4060) and related submetrics. Many organizations may not be able to report on the number of client households using direct data. For example, organizations that sell water purification systems through a series of local network distributors might estimate the number of client households reached based on the number of units sold. Organizations should footnote details on how and why these assumptions were made. This metric is multi-dimensional with regard to the five dimensions of impact. It may help describe the WHO dimension when the stakeholder group represented by the metric is the stakeholder group targeted by the investment or organization. It may also help measure the HOW MUCH Scale dimension, which helps estimate the number of the targeted stakeholders experiencing the outcome. For more on the alignment of IRIS metrics to the five dimensions of impact, see IRIS+ and the Five Dimensions of Impact (https://iris.thegiin.org/document/iris-and-the-five-dimensions/). No single metric is sufficient to understand an impact; rather, metrics are selected as a set across all dimensions of impact. When possible, the selection of metrics to measure and describe the five dimensions should be based on best practice and evidence.
defined by: giin

Percent Revenue Generated from Social/Environmental Products and Services
type: Concept
type: Code
has name: Percent Revenue Generated from Social/Environmental Products and Services
has description: Percentage of revenue that the organization earns from projects and services designed to deliver a specific social or environmental benefit during the reporting period.
definition: Percentage of revenue that the organization earns from projects and services designed to deliver a specific social or environmental benefit during the reporting period.
has identifier: PI8168
notation: PI8168
had primary source: PI8168
note: Organizations should footnote examples of products and services categorized as providing social/environmental benefit. See usage guidance for further information.
scope note: This metric is intended to capture the percentage of the organization’s revenue during the reporting period earned from projects and services designed to deliver a specific social or environmental benefit. Products and services designed to deliver a specific social benefit could include those that target an underserved, historically marginalized, or highly disadvantaged population, such as providing clean water to remote rural villages. Products and services designed to deliver a specific environmental benefit could include providing commercial solar panels to replace kerosene lanterns as the target stakeholder’s energy source.
defined by: giin

Non-hazardous Waste Avoided
type: Concept
type: Code
has name: Non-hazardous Waste Avoided
has description: Amount of non-hazardous waste disposal avoided through refurbishing, reusing, and recycling as part of delivering or developing the organization's products and services during the reporting period.
definition: Amount of non-hazardous waste disposal avoided through refurbishing, reusing, and recycling as part of delivering or developing the organization's products and services during the reporting period.
has identifier: PI8177
notation: PI8177
had primary source: PI8177
note: Organizations should footnote all assumptions used.
scope note: This metric is intended to capture non-hazardous waste avoided as a result of substituting recycled materials in the organization's products and services. Organizations should report the total amount of non-hazardous waste avoided for all products and services delivered or developed during the reporting period. Organizations that offer recycling services should report non-hazardous waste avoided as a result of the organization's delivery of non-hazardous waste recycling services. In some contexts, this metric can serve as an indicator of whether the outcome being sought by an investor or organization is occurring (the WHAT dimension of impact). For more on the alignment of IRIS metrics to the five dimensions of impact, see IRIS+ and the Five Dimensions of Impact (https://iris.thegiin.org/document/iris-and-the-five-dimensions/). No single metric is sufficient to understand an impact; rather, metrics are selected as a set across all dimensions of impact. When possible, the selection of metrics to measure and describe the five dimensions should be based on best practice and evidence.
defined by: giin

Responsible Financial Products/Services Offered
type: Concept
type: Code
has name: Responsible Financial Products/Services Offered
has identifier: PI8255
notation: PI8255
had primary source: PI8255
note: Organizations should footnote all assumptions used, including source of data or disaggregation and any other disaggregations applied.
scope note: This metric is intended to capture a description of the use of a financial product or service provided from among the options given in the definition. Organizations can report this metric at an organizational level (selecting all product/services that apply) or for a specific product/service (selecting the product/service for which the organization is reporting). This disaggregation, applied to another metric, is intended to capture the share of that metric which relates to the selected use(s) of a financial product or service. For example, the disaggregation "mortgage" when applied to Client Individuals (PI4060) would include the number of client individuals that received a mortgage product. Similarly, the disaggregation "green financing" when applied to Sales Revenue (PI1775) would include the value of revenue attributed to the sale of green financing products.
has description: Describes the use of the financial product/service provided by the organization, or disaggregates another metric in terms of one or more financial product or service. For loans, this is often called "loan type." Select any that apply: Basic Services - Mortgage - Home equity - Education - Green financing - Lease financing - Emergency - Group lending - Other (write-in) Business - Working capital - Asset financing - Term loans - Invoice financing - Other (write-in) Other (write-in)
definition: Describes the use of the financial product/service provided by the organization, or disaggregates another metric in terms of one or more financial product or service. For loans, this is often called "loan type." Select any that apply: Basic Services - Mortgage - Home equity - Education - Green financing - Lease financing - Emergency - Group lending - Other (write-in) Business - Working capital - Asset financing - Term loans - Invoice financing - Other (write-in) Other (write-in)
defined by: giin

Units/Volume Sold: Free
type: Concept
type: Code
has name: Units/Volume Sold: Free
has description: Amount of the product/service provided by the organization for free during the reporting period.
definition: Amount of the product/service provided by the organization for free during the reporting period.
has identifier: PI8329
notation: PI8329
had primary source: PI8329
note: Organizations should footnote all assumptions used.
scope note: This metric is intended to capture the volume of products/services distributed for which the organization neither receives nor requests payment from either the recipient or a third party for the products/services. For example, a health clinic that provides free vaccines out of their operating budget would use Units/Volume Sold: Free to capture the number of vaccines administered. Organizations that sell different types of products/services should consider reporting separately against each different product/service.
defined by: giin

Client Individuals: Female
type: Concept
type: Code
has name: Client Individuals: Female
has description: Number of unique women who were clients of the organization during the reporting period.
definition: Number of unique women who were clients of the organization during the reporting period.
has identifier: PI8330
notation: PI8330
had primary source: PI8330
note: Organizations should footnote all assumptions used, including source of data. See usage guidance for further information.
scope note: This metric is intended to capture the number of unique female clients who received the organization’s products or services during the reporting period. It is not a measure of foot traffic, nor is it intended to capture the number of consumer transactions. For example, a customer who makes two purchases during a period should be counted only once. Organizations wishing to report on total client transactions should refer to Client Transactions (PI5184). This metric is intended to capture the unique number of specific individuals served. Organizations should not use any household multipliers when reporting against this metric. If organizations consider entire households to be the customer/client, they can report against Client Households: Total (PI7954) and its associated submetrics. Many organizations may not be able to report on the number of clients using direct data. For example, organizations that sell solar lanterns through a series of local network distributors might estimate the number of client individuals reached based on the number of units sold. Organizations should footnote details on how and why these assumptions were made. For healthcare providers, “client individuals” refers to patients. For housing providers, “client individuals” refers to residents or tenants. This metric is multi-dimensional with regard to the five dimensions of impact. It may help describe the WHO dimension when the stakeholder group represented by the metric is the stakeholder group targeted by the investment or organization. It may also help measure the HOW MUCH Scale dimension, which helps estimate the number of the targeted stakeholders experiencing the outcome. For more on the alignment of IRIS metrics to the five dimensions of impact, see IRIS+ and the Five Dimensions of Impact (https://iris.thegiin.org/document/iris-and-the-five-dimensions/). No single metric is sufficient to understand an impact; rather, metrics are selected as a set across all dimensions of impact. When po…
defined by: giin

Supplier Individuals: Very Poor
type: Concept
type: Code
has name: Supplier Individuals: Very Poor
has description: Number of very poor individuals who sold goods or services to the organization during the reporting period.
definition: Number of very poor individuals who sold goods or services to the organization during the reporting period.
has identifier: PI8337
notation: PI8337
had primary source: PI8337
note: Organizations should footnote all assumptions used, including details on the assessment tools used to identify the poverty level of suppliers. See usage guidance for further information.
scope note: This metric is intended to capture how organizations support the livelihoods of individuals living in poverty through their supply chains. Because assessing the poverty level of stakeholders is complex, organizations will likely have to use specific assessment tools to accurately report on this metric. See the glossary definition for additional information on commonly used tools to help determine the absolute poverty level of individuals and households. This metric is multi-dimensional with regard to the five dimensions of impact: it may help describe the WHO dimension when the stakeholder group represented by the metric is the stakeholder group targeted by the investment or organization. It may also help measure the HOW MUCH Scale dimension, which helps estimate the number of the targeted stakeholders experiencing the outcome. For more on the alignment of IRIS metrics to the five dimensions of impact, see IRIS+ and the Five Dimensions of Impact (https://iris.thegiin.org/document/iris-and-the-five-dimensions/). No single metric is sufficient to understand an impact; rather, metrics are selected as a set across all dimensions of impact. When possible, the selection of metrics to measure and describe the five dimensions should be based on best practice and evidence.
defined by: giin

Student Tests Pass Rate
type: Concept
type: Code
has name: Student Tests Pass Rate
has description: Percentage of students at a school passing standardized tests offered by a regional governance body during the reporting period.
definition: Percentage of students at a school passing standardized tests offered by a regional governance body during the reporting period.
has identifier: PI8372
notation: PI8372
had primary source: PI8372
note: Organizations should footnote a description of the standardized test, the threshold for passing, how many tests were taken, and other relevant details.
scope note: This metric is intended to capture the percentage of students who have passed standardized tests. For example, if two students take a test and only one achieves a passing score, this metric is 50%. If students take more than one test, organizations should report the average pass rate across all tests. In many cases, data are collected by schools (public or private) or another third party. Where possible, organizations should aim to report the related metric Average Student Test Score (PI9024), which captures growth in test scores rather than an absolute pass rate. Organizations may disaggregate data by grade level as needed to identify underlying patterns. In all contexts, tests should reflect learners' social, environmental, and learning norms and needs. Organizations are encouraged to footnote details on how and by whom tests have been developed, as well as how they are fit to context. In some contexts, this metric can serve as an indicator of whether the outcome being sought by an investor or organization is occurring (the WHAT dimension of impact). For more on the alignment of IRIS metrics to the five dimensions of impact, see IRIS+ and the Five Dimensions of Impact (https://iris.thegiin.org/document/iris-and-the-five-dimensions/). No single metric is sufficient to understand an impact; rather, metrics are selected as a set across all dimensions of impact. When possible, the selection of metrics to measure and describe the five dimensions should be based on best practice and evidence.
defined by: giin

Number of Loans Disbursed
type: Concept
type: Code
has name: Number of Loans Disbursed
has description: Number of loans disbursed by the organization during the reporting period.
definition: Number of loans disbursed by the organization during the reporting period.
has identifier: PI8381
notation: PI8381
had primary source: PI8381
note: Organizations should footnote all assumptions used.
scope note: This metric is intended to capture how many loans the organization disbursed during the reporting period. Microfinance institutions (MFIs) using a group-lending methodology should count separately under this metric every individual who is responsible for repaying a portion of a group loan, unless another definition is footnoted.
defined by: giin

Space Per Passenger
type: Concept
type: Code
has name: Space Per Passenger
has description: Amount of space per passenger (in an airport, passenger port, or vehicle) during the reporting period.
definition: Amount of space per passenger (in an airport, passenger port, or vehicle) during the reporting period.
has identifier: PI8394
notation: PI8394
had primary source: PI8394
note: Organizations should footnote all assumptions used, including source of data.
scope note: This metric is intended to capture the amount of space available to each client (passenger) in a vehicle (for example, a train, boat, or airplane) or waiting place (such as an airport). This metric provides an indication of quality of service. This metric is often used by International Finance Institutions (IFIs) as part of transportation analysis.
defined by: giin

Distributor Organizations: Microenterprises
type: Concept
type: Code
has name: Distributor Organizations: Microenterprises
has description: Number of microenterprises that served as distributors of the organization’s products/services during the reporting period.
definition: Number of microenterprises that served as distributors of the organization’s products/services during the reporting period.
has identifier: PI8415
notation: PI8415
had primary source: PI8415
note: Organizations should footnote all assumptions used.
scope note: This metric is intended to capture how many microenterprises sold the organization’s products or services during the reporting period, either to other distributors (wholesale) or to ultimate consumers (retail). Distributors counted under this metric need not exclusively sell the organization’s products or services. This metric is multi-dimensional with regard to the five dimensions of impact: it may help describe the WHO dimension when the stakeholder group represented by the metric is the stakeholder group targeted by the investment or organization. It may also help measure the HOW MUCH Scale dimension, which helps estimate the number of the targeted stakeholders experiencing the outcome. For more on the alignment of IRIS metrics to the five dimensions of impact, see IRIS+ and the Five Dimensions of Impact (https://iris.thegiin.org/document/iris-and-the-five-dimensions/). No single metric is sufficient to understand an impact; rather, metrics are selected as a set across all dimensions of impact. When possible, the selection of metrics to measure and describe the five dimensions should be based on best practice and evidence.
defined by: giin

Units/Volume Purchased from Supplier Organizations: Local
type: Concept
type: Code
has name: Units/Volume Purchased from Supplier Organizations: Local
has description: Units/volume from local organizations that sold to the reporting organization during the reporting period.
definition: Units/volume from local organizations that sold to the reporting organization during the reporting period.
has identifier: PI8418
notation: PI8418
had primary source: PI8418
note: Organizations should footnote their definition of "local" and all other assumptions used, including source of data. See usage guidance for further information.
scope note: This metric is intended to capture the total units or volume an organization purchased from local supplier organizations during the reporting period. Individual organizations' definitions of local will depend on their business models and impact objectives. For example, if their purpose is economic development, they may define "local" within geo-political boundaries. If they focus on reducing emissions, they may define "local" by specific distance. Organizations that purchase different types of products/services should consider reporting separately against each different type of product/service. Organizations may wish to report this metric in conjunction with Supplier Organizations: Local (PI6385).
defined by: giin

Units/Volume Sold: No Direct Payment
type: Concept
type: Code
has name: Units/Volume Sold: No Direct Payment
has description: Amount of the product/service sold during the reporting period for which no direct payment was provided to the organization at the time of service but for which the organization expects to be reimbursed.
definition: Amount of the product/service sold during the reporting period for which no direct payment was provided to the organization at the time of service but for which the organization expects to be reimbursed.
has identifier: PI8454
notation: PI8454
had primary source: PI8454
note: Organizations should footnote all assumptions used.
scope note: This metric is intended to capture the amount of products/services distributed for which the recipient made no payment but for which the organization received (or expects to receive) payment or reimbursement by a third party (for example, an insurance company). For example, a medical office that provides annual physicals for which the patient has no copay but an insurance company pays a fee on the patient’s behalf would capture that service under this metric. Organizations that sell different types of products/services should consider reporting separately against each different product/service.
defined by: giin

Distributor Individuals: Historically Marginalized
type: Concept
type: Code
has name: Distributor Individuals: Historically Marginalized
has description: Number of individuals who belong to groups historically marginalized on the basis of race and/or ethnicity and who served as distributors of the organization’s products/services during the reporting period.
definition: Number of individuals who belong to groups historically marginalized on the basis of race and/or ethnicity and who served as distributors of the organization’s products/services during the reporting period.
has identifier: PI8470
notation: PI8470
had primary source: PI8470
note: Organizations should footnote all assumptions used, including their categorization of historically marginalized groups. See usage guidance for further information.
scope note: This metric is intended to capture how many self-employed individuals who belong to a group historically marginalized on the basis of race and/or ethnicity sold the organization’s products or services during the reporting period, either to other distributors (wholesale) or to ultimate consumers (retail). Distributors counted under this metric need not exclusively sell the organization’s products or services. Direct employees who distribute the organization's goods or services should be considered employees, not distributors. The categorization of historically marginalized groups varies with location and context. With no internationally agreed-upon definition as to which groups constitute historically marginalized on the basis of race and/or ethnicity, if well-established local policies exist (as in South Africa, with the Broad Based Black Economic Empowerment [BBBEE] definition of historically marginalized, or in India, based on backward caste), organizations should refer to these local guidelines to identify groups historically marginalized on the basis of race and/or ethnicity. Otherwise, and wherever appropriate, organizations should provide additional detail regarding their tailored methodology for defining these groups. This metric is multi-dimensional with regard to the five dimensions of impact: it may help describe the WHO dimension when the stakeholder group represented by the metric is the stakeholder group targeted by the investment or organization. It may also help measure the HOW MUCH Scale dimension, which helps estimate the number of the targeted stakeholders experiencing the outcome. For more on the alignment of IRIS metrics to the five dimensions of impact, see IRIS+ and the Five Dimensions of Impact (https://iris.thegiin.org/document/iris-and-the-five-dimensions/). No single metric is sufficient to understand an impact; rather, metrics are selected as a set across all dimensions of impact. When possible, the selection of metrics to measure and desc…
defined by: giin

Percent Supplier Payments to Stallholders
type: Concept
type: Code
has name: Percent Supplier Payments to Stallholders
has description: Payments made to smallholder farmer suppliers as a percentage of total payments made to all suppliers of the organization during the reporting period.
definition: Payments made to smallholder farmer suppliers as a percentage of total payments made to all suppliers of the organization during the reporting period.
has identifier: PI8632
notation: PI8632
had primary source: PI8632
note: Organizations should footnote all assumptions used, including source of data.
scope note: This metric is intended to capture the percent of payments to suppliers that went to smallholder farmers during the reporting period. This metric may be useful for organizations that procure agricultural products (for example, coffee, tea, or vanilla) from smallholder farmers. In some contexts, this metric can serve as an indicator of whether the outcome being sought by an investor or organization is occurring (the WHAT dimension of impact). For more on the alignment of IRIS metrics to the five dimensions of impact, see specific guidance document. No single metric is sufficient to understand an impact; rather, metrics are selected as a set across all dimensions of impact. When possible, the selection of metrics to measure and describe the five dimensions should be based on best practice and evidence.
defined by: giin

Energy Generated for Sale: Total
type: Concept
type: Code
has name: Energy Generated for Sale: Total
has description: Amount of energy generated and sold to offtaker(s) during the reporting period.
definition: Amount of energy generated and sold to offtaker(s) during the reporting period.
has identifier: PI8706
notation: PI8706
had primary source: PI8706
note: Organizations should footnote the energy type(s) and all assumptions used.
scope note: This metric is intended to capture energy generated for commercial sale by the organization. Bulk energy is usually sold under a power purchase agreement with an electricity utility. The buyer or purchaser of this energy is termed the offtaker. The standard unit of measure for International Finance Institutions (IFIs) is GWh. For other Units of Measure, refer to Unit of Measure (PD1602). To disaggregate this total by the type of energy generated for sale—for example, non-renewable vs. renewable sources—report this metric disaggregated by the relevant options from Primary Energy Source (OI3781). Organizations interested in reporting energy production at the product level should report Energy Capacity of Products Sold (PD1504), Energy Capacity of Product (PD2713), or both. Organizations wishing to report the amount of energy generated for their own use should instead report Energy Generated for Use: Total (OI9624). In some contexts, this metric can serve as an indicator of whether the outcome being sought by an investor or organization is occurring (the WHAT dimension of impact). For more on the alignment of IRIS metrics to the five dimensions of impact, see IRIS+ and the Five Dimensions of Impact (https://iris.thegiin.org/document/iris-and-the-five-dimensions/). No single metric is sufficient to understand an impact; rather, metrics are selected as a set across all dimensions of impact. When possible, the selection of metrics to measure and describe the five dimensions should be based on best practice and evidence.
defined by: giin

Client Individuals: New
type: Concept
type: Code
has name: Client Individuals: New
has description: Number of unique individuals who were first-time clients of the organization during the reporting period.
definition: Number of unique individuals who were first-time clients of the organization during the reporting period.
has identifier: PI8732
notation: PI8732
had primary source: PI8732
note: Organizations should footnote all assumptions used, including source of data. See usage guidance for further information.
scope note: This metric is intended to capture the number of unique clients who received the organization’s products or services during the reporting period for the first time. It is not a measure of foot traffic, nor is it intended to capture the number of consumer transactions. For example, a customer who makes two purchases during a period should be counted only once. Organizations wishing to report on total client transactions should refer to Client Transactions (PI5184). Depending on the industry and business model, organizations may define new clients as those who re-engage with the organization after a designated time period. For example, the Microfinance Information Exchange (MIX) defines new borrowers as either those who receive loans for the first time from the institution or borrowers who rejoin after more than one year. This metric is intended to capture the unique number of specific individuals served. Organizations should not use any household multipliers when reporting against this metric. If organizations consider entire households to be the customer/client, they can report against Client Households: Total (PI7954) and its associated submetrics. Many organizations may not be able to report on the number of clients using direct data. For example, organizations that sell solar lanterns through a series of local network distributors might estimate the number of client individuals reached based on the number of units sold. Organizations should footnote details on how and why these assumptions were made. For healthcare providers, “client individuals” refers to patients. For housing providers, “client individuals” refers to residents or tenants. This metric is multi-dimensional with regard to the five dimensions of impact. It may help describe the WHO dimension when the stakeholder group represented by the metric is the stakeholder group targeted by the investment or organization. It may also help measure the HOW MUCH Scale dimension, which helps estimate the number o…
defined by: giin

Client Housing Quality Satisfaction
type: Concept
type: Code
has name: Client Housing Quality Satisfaction
has description: NOTE: This metric has been discontinued. Please use Target Stakeholder Satisfaction Score (PI7163).
definition: NOTE: This metric has been discontinued. Please use Target Stakeholder Satisfaction Score (PI7163).
has identifier: PI8768
notation: PI8768
had primary source: PI8768
note: Organizations should footnote all assumptions made.
scope note: NOTE: This metric has been discontinued. This metric is intended to capture resident satisfaction with the housing units they occupy. Organizations should not measure client satisfaction with housing options beyond the unit occupied. Organizations should report both the total number of resident responses that are "somewhat satisfied" or "very satisfied" and this count as a percentage of total responses. In some contexts, this metric can serve as an indicator of whether the outcome being sought by an investor or organization is occurring (the WHAT dimension of impact). For more on the alignment of IRIS metrics to the five dimensions of impact, see IRIS+ and the Five Dimensions of Impact (https://iris.thegiin.org/document/iris-and-the-five-dimensions/). No single metric is sufficient to understand an impact; rather, metrics are selected as a set across all dimensions of impact. When possible, the selection of metrics to measure and describe the five dimensions should be based on best practice and evidence.
defined by: giin

Number of Insurance Policies
type: Concept
type: Code
has name: Number of Insurance Policies
has description: Number of insurance policies managed by the organization as of the end of the reporting period.
definition: Number of insurance policies managed by the organization as of the end of the reporting period.
has identifier: PI8785
notation: PI8785
had primary source: PI8785
note: Organizations should footnote all assumptions used, as well as the type of insurance and client premium.
scope note: This metric is intended to capture a total count of policies taken out by clients of the organization. For example, if one client takes out two different insurance policies, this metric would count both policies.
defined by: giin

Supplier Individuals: Low Income
type: Concept
type: Code
has name: Supplier Individuals: Low Income
has description: Number of low-income individuals who sold goods or services to the organization during the reporting period.
definition: Number of low-income individuals who sold goods or services to the organization during the reporting period.
has identifier: PI8819
notation: PI8819
had primary source: PI8819
note: Organizations should footnote all assumptions used, including details on the assessment tools used to identify low-income suppliers. See usage guidance for further information.
scope note: This metric is intended to capture how organizations support the livelihoods of low-income individuals through their supply chains. Because assessing the poverty level of stakeholders is complex, organizations will likely have to use specific assessment tools to accurately report on this metric. See the glossary definition for additional information on commonly used tools to help determine the absolute poverty level of individuals and households. This metric is multi-dimensional with regard to the five dimensions of impact: it may help describe the WHO dimension when the stakeholder group represented by the metric is the stakeholder group targeted by the investment or organization. It may also help measure the HOW MUCH Scale dimension, which helps estimate the number of the targeted stakeholders experiencing the outcome. For more on the alignment of IRIS metrics to the five dimensions of impact, see IRIS+ and the Five Dimensions of Impact (https://iris.thegiin.org/document/iris-and-the-five-dimensions/). No single metric is sufficient to understand an impact; rather, metrics are selected as a set across all dimensions of impact. When possible, the selection of metrics to measure and describe the five dimensions should be based on best practice and evidence.
defined by: giin

Vocational/Technical Training
type: Concept
type: Code
has name: Vocational/Technical Training
has description: Number of students receiving vocational or technical training during the reporting period.
definition: Number of students receiving vocational or technical training during the reporting period.
has identifier: PI8836
notation: PI8836
had primary source: PI8836
note: Organizations should footnote all assumptions used, as well as details about the type of vocational/technical training received by the students.
scope note: This metric is intended to capture the number of students of the organization receiving vocational or technical training during the reporting period. This metric is multi-dimensional with regard to the five dimensions of impact. It may help describe the WHO dimension when the stakeholder group represented by the metric is the stakeholder group targeted by the investment or organization. It may also help measure the HOW MUCH Scale dimension, which helps estimate the number of the targeted stakeholders experiencing the outcome. For more on the alignment of IRIS metrics to the five dimensions of impact, see IRIS+ and the Five Dimensions of Impact (https://iris.thegiin.org/document/iris-and-the-five-dimensions/). No single metric is sufficient to understand an impact; rather, metrics are selected as a set across all dimensions of impact. When possible, the selection of metrics to measure and describe the five dimensions should be based on best practice and evidence.
defined by: giin

Promptness of Claims Processing
type: Concept
type: Code
has name: Promptness of Claims Processing
has description: Average number of days elapsed between the submission of a completed claim by a stakeholder (client of the organization) and their receipt of payment or claim denial, for all claims settled during the reporting period.
definition: Average number of days elapsed between the submission of a completed claim by a stakeholder (client of the organization) and their receipt of payment or claim denial, for all claims settled during the reporting period.
has identifier: PI8919
notation: PI8919
had primary source: PI8919
note: Organizations should footnote all assumptions used.
scope note: This metric is intended to capture how long on average (in days) it takes the organization to process completed claims. Organizations should calculate this metric using the average days’ duration between the date of a claim’s submission and the date that the affected stakeholder receives payment or claim denial. Organizations can use the raw data relevant to this metric when calculating Promptness of Claims Settlement (PI9897). For more detail on the Promptness of Claims Settlement and for guidance on interpretation, see the Microinsurance Network's Social Performance Indicators for Microinsurance, p. 19 (https://www.social-protection.org/gimi/ShowRessource.action?id=5270).
defined by: giin

Earnings of Distributor Individuals: Rural
type: Concept
type: Code
has name: Earnings of Distributor Individuals: Rural
has description: Earnings of individual distributors residing in rural areas as a result of selling the organization’s products/services during the reporting period.
definition: Earnings of individual distributors residing in rural areas as a result of selling the organization’s products/services during the reporting period.
has identifier: PI8943
notation: PI8943
had primary source: PI8943
note: Organizations should footnote all assumptions used.
scope note: This metric is intended to capture the total gross margin earned by, or commission paid to, individual rural distributors, a measure of how organizations support the livelihoods of rural individuals through their distribution chains.
defined by: giin

Client Organizations: No Direct Payment
type: Concept
type: Code
has name: Client Organizations: No Direct Payment
has description: Number of enterprise clients that received products/services during the reporting period for which the organization was provided no direct payment at the time of service but for which the organization expects to be reimbursed.
definition: Number of enterprise clients that received products/services during the reporting period for which the organization was provided no direct payment at the time of service but for which the organization expects to be reimbursed.
has identifier: PI8952
notation: PI8952
had primary source: PI8952
note: Organizations should footnote all assumptions used, including source of data. Organizations should also footnote the types of enterprises that were clients, using Client Type (PD7993).
scope note: This metric is intended to capture the number of unique client organizations that received products or services from the organization during the reporting period for which no out-of-pocket payment was provided but for which the organization expects to be reimbursed by third parties (such as insurance). Organizations should include the number of unique client organizations that received products or services for which they made no direct payment, regardless of whether or not these clients may have also received other services during the reporting period for which they made out-of-pocket payments.
defined by: giin

Distributor Individuals: Urban
type: Concept
type: Code
has name: Distributor Individuals: Urban
has description: Number of individuals residing in urban areas who served as distributors of the organization’s products/services during the reporting period.
definition: Number of individuals residing in urban areas who served as distributors of the organization’s products/services during the reporting period.
has identifier: PI8982
notation: PI8982
had primary source: PI8982
note: Organizations should footnote all assumptions used.
scope note: This metric is intended to capture how many self-employed urban individuals sold the organization’s products or services during the reporting period, either to other distributors (wholesale) or to ultimate consumers (retail). Distributors counted under this metric need not exclusively sell the organization’s products or services. Direct employees who distribute the organization's goods or services should be considered employees, not distributors. This metric is multi-dimensional with regard to the five dimensions of impact: it may help describe the WHO dimension when the stakeholder group represented by the metric is the stakeholder group targeted by the investment or organization. It may also help measure the HOW MUCH Scale dimension, which helps estimate the number of the targeted stakeholders experiencing the outcome. For more on the alignment of IRIS metrics to the five dimensions of impact, see IRIS+ and the Five Dimensions of Impact (https://iris.thegiin.org/document/iris-and-the-five-dimensions/). No single metric is sufficient to understand an impact; rather, metrics are selected as a set across all dimensions of impact. When possible, the selection of metrics to measure and describe the five dimensions should be based on best practice and evidence.
defined by: giin

Payments to Supplier Individuals: Low Income
type: Concept
type: Code
has name: Payments to Supplier Individuals: Low Income
has description: Value of payments made by the organization to low-income individuals who sold goods or services to the organization during the reporting period.
definition: Value of payments made by the organization to low-income individuals who sold goods or services to the organization during the reporting period.
has identifier: PI8999
notation: PI8999
had primary source: PI8999
note: Organizations should footnote all assumptions used, including details on the assessment tools used to identify low-income suppliers. See usage guidance for further information.
scope note: This metric is intended to capture how organizations support low-income populations through their supply chains. Because assessing the poverty level of stakeholders is complex, organizations will likely have to use specific assessment tools to accurately report on this metric. See the glossary definition for additional information on commonly used tools to help determine the absolute poverty level of individuals and households.
defined by: giin

Average Student Test Score
type: Concept
type: Code
has name: Average Student Test Score
has description: Average test score (as a percentage of a perfect score) earned by students served by the organization during the reporting period.
definition: Average test score (as a percentage of a perfect score) earned by students served by the organization during the reporting period.
has identifier: PI9024
notation: PI9024
had primary source: PI9024
note: Organizations should footnote all assumptions used, including which tests form the basis of this calculation.
scope note: This metric is intended to capture the average percent of total possible points students earned on tests during the reporting period. For example, if Student A earned 75/100 points and Student B earned 30/100 points, the Average Student Test Score for these two students would be 52.5/100 points, or 52.5%. Students who were not tested should not be included in this calculation. In many cases, test-score data are collected by schools (public or private) or another third party. In educational contexts, Client Individuals: Total (PI4060) can refer to students and may be used in this calculation in place of School Enrollment (PI2389). Organizations may also disaggregate data by grade level as needed to identify underlying patterns. In all contexts, tests should reflect learners' social, environmental, and learning norms and needs. Organizations are encouraged to footnote details on how and by whom tests have been developed, as well as how they are fit to context. Average Student Test Score (PI9024), combined with factors included under "HOW is change happening?," gives a directional indicator of student learning outcomes. In some contexts, however, Student Promotion Rate (PI4924)—which measures the number of students proceeding to the next grade—may be a more appropriate outcome metric. In these cases, Student Promotion Rate (PI4924) should be substituted for Average Student Test Score (PI9024) under WHAT and HOW MUCH. For more details on calculation, see usage guidance for each specific metric in the catalog. In some contexts, this metric can serve as an indicator of whether the outcome being sought by an investor or organization is occurring (the WHAT dimension of impact). For more on the alignment of IRIS metrics to the five dimensions of impact, see IRIS+ and the Five Dimensions of Impact (https://iris.thegiin.org/document/iris-and-the-five-dimensions/). No single metric is sufficient to understand an impact; rather, metrics are selected as a set across all dimension…
defined by: giin

Units/Volume Sold: Exported
type: Concept
type: Code
has name: Units/Volume Sold: Exported
has description: Amount of the product/service exported by the organization during the reporting period.
definition: Amount of the product/service exported by the organization during the reporting period.
has identifier: PI9029
notation: PI9029
had primary source: PI9029
note: Organizations should footnote all assumptions used.
scope note: This metric is intended to capture the organization’s export sales during the reporting period. Organizations that sell different types of products/services should consider reporting separately against each different product/service.
defined by: giin

Payments to Supplier Individuals: Very Poor
type: Concept
type: Code
has name: Payments to Supplier Individuals: Very Poor
has description: Value of payments made by the organization to very poor individuals who sold goods or services to the organization during the reporting period.
definition: Value of payments made by the organization to very poor individuals who sold goods or services to the organization during the reporting period.
has identifier: PI9048
notation: PI9048
had primary source: PI9048
note: Organizations should footnote all assumptions used, including details on the assessment tools used to identify the poverty level of suppliers. See usage guidance for further information.
scope note: This metric is intended to capture how organizations support the livelihoods of individuals living in poverty through their supply chains. Because assessing the poverty level of stakeholders is complex, organizations will likely have to use specific assessment tools to accurately report on this metric. See the glossary definition for additional information on commonly used tools to help determine the absolute poverty level of individuals and households.
defined by: giin

Distributor Individuals: Very Poor
type: Concept
type: Code
has name: Distributor Individuals: Very Poor
has description: Number of very poor individuals who served as distributors of the organization’s products/services during the reporting period.
definition: Number of very poor individuals who served as distributors of the organization’s products/services during the reporting period.
has identifier: PI9113
notation: PI9113
had primary source: PI9113
note: Organizations should footnote all assumptions used, including details on the assessment tools used to identify the poverty level of distributors. See usage guidance for further information.
scope note: This metric is intended to capture how many self-employed very poor individuals sold the organization’s products or services during the reporting period, either to other distributors (wholesale) or to ultimate consumers (retail). This is a measure of how organizations support individuals living in poverty through their distribution chains. Distributors counted under this metric need not exclusively sell the organization’s products or services. Direct employees who distribute the organization's goods or services should be considered employees, not distributors. Because assessing the poverty level of stakeholders is complex, organizations will likely have to use specific assessment tools to accurately report on this metric. See the glossary definition for additional information on commonly used tools to help determine the absolute poverty level of individuals and households. This metric is multi-dimensional with regard to the five dimensions of impact: it may help describe the WHO dimension when the stakeholder group represented by the metric is the stakeholder group targeted by the investment or organization. It may also help measure the HOW MUCH Scale dimension, which helps estimate the number of the targeted stakeholders experiencing the outcome. For more on the alignment of IRIS metrics to the five dimensions of impact, see IRIS+ and the Five Dimensions of Impact (https://iris.thegiin.org/document/iris-and-the-five-dimensions/). No single metric is sufficient to understand an impact; rather, metrics are selected as a set across all dimensions of impact. When possible, the selection of metrics to measure and describe the five dimensions should be based on best practice and evidence.
defined by: giin

Number of Threatened Species
type: Concept
type: Code
has name: Number of Threatened Species
has description: Number of threatened species present on land directly controlled by the organization during the reporting period.
definition: Number of threatened species present on land directly controlled by the organization during the reporting period.
has identifier: PI9151
notation: PI9151
had primary source: PI9151
note: Organizations should footnote all assumptions used, including source(s) of data.
scope note: This metric is intended to capture the number of threatened species present on land that is directly controlled by the organization, which is measured by Land Directly Controlled: Total (OI5408). Organizations should use this metric in conjunction with Species Conservation Status (PD6429), and, where relevant, the number of threatened species should be segmented by their conservation statuses.
defined by: giin

Area of Buildings Reused
type: Concept
type: Code
has name: Area of Buildings Reused
has description: Area of buildings projected to be renovated or remodeled for building reuse as a result of investments made by the organization during the reporting period.
definition: Area of buildings projected to be renovated or remodeled for building reuse as a result of investments made by the organization during the reporting period.
has identifier: PI9170
notation: PI9170
had primary source: PI9170
note: Organizations should footnote details on why the renovated or remodeled building areas qualify for reuse.
scope note: This metric is intended to capture the area of reused buildings that will be renovated or remodeled as a result of investments made by the organization during the reporting period. In order to qualify for reuse, the time elapsed since the completion of original construction must meet or exceed 40 years. Buildings are often renovated or remodeled for reuse to conserve resources, extend the life of existing building stock, retain cultural resources, reduce waste, and avoid the additional environmental impacts of new construction.
defined by: giin

Active Borrowers per Loan Officer
type: Concept
type: Code
has name: Active Borrowers per Loan Officer
has description: Number of active borrowers (clients) per loan officer at the organization as of the end of the reporting period.
definition: Number of active borrowers (clients) per loan officer at the organization as of the end of the reporting period.
has identifier: PI9250
notation: PI9250
had primary source: PI9250
note: Organizations should footnote all assumptions used.
scope note: This metric is intended to capture the ratio between clients of the organization and loan officers. For financial institutions (including microfinance institutions), active borrowers refers to the number of individuals who currently have an outstanding loan balance with the organization.
defined by: giin

Supplier Individuals: Historically Marginalized
type: Concept
type: Code
has name: Supplier Individuals: Historically Marginalized
has description: Number of individuals who belong to groups historically marginalized on the basis of race and/or ethnicity and who sold goods or services to the organization during the reporting period.
definition: Number of individuals who belong to groups historically marginalized on the basis of race and/or ethnicity and who sold goods or services to the organization during the reporting period.
has identifier: PI9261
notation: PI9261
had primary source: PI9261
note: Organizations should footnote all assumptions used, including their categorization of historically marginalized groups. See usage guidance for further information.
scope note: This metric is intended to capture how organizations support individuals who belong to groups historically marginalized on the basis of race and/or ethnicity through their supply chains. The categorization of historically marginalized groups varies with location and context. With no internationally agreed-upon definition as to which groups constitute historically marginalized on the basis of race and/or ethnicity, if well-established local policies exist (as in South Africa, with the Broad Based Black Economic Empowerment [BBBEE] definition of historically marginalized, or in India, based on backward caste), organizations should refer to these local guidelines to identify groups historically marginalized on the basis of race and/or ethnicity. Otherwise, and wherever appropriate, organizations should provide additional detail regarding their tailored methodology for defining these groups. This metric is multi-dimensional with regard to the five dimensions of impact: it may help describe the WHO dimension when the stakeholder group represented by the metric is the stakeholder group targeted by the investment or organization. It may also help measure the HOW MUCH Scale dimension, which helps estimate the number of the targeted stakeholders experiencing the outcome. For more on the alignment of IRIS metrics to the five dimensions of impact, see IRIS+ and the Five Dimensions of Impact (https://iris.thegiin.org/document/iris-and-the-five-dimensions/). No single metric is sufficient to understand an impact; rather, metrics are selected as a set across all dimensions of impact. When possible, the selection of metrics to measure and describe the five dimensions should be based on best practice and evidence.
defined by: giin

Client Retention Rate
type: Concept
type: Code
has name: Client Retention Rate
has description: Ratio of the number of the organization's active clients retained from as of the end of the reporting period compared to the number of active clients with which the organization began the reporting period.
definition: Ratio of the number of the organization's active clients retained from as of the end of the reporting period compared to the number of active clients with which the organization began the reporting period.
has identifier: PI9319
notation: PI9319
had primary source: PI9319
note: Organizations should footnote all assumptions used, including source of data.
scope note: This metric is intended to capture the proportion of clients retained without differentiating between new and rejoining clients. The relevance and interpretation of this metric depends heavily on business model. For further guidance on calculating retention rate, specifically in the context of microfinance, see Chuck Waterfield, “The Challenges of Measuring Client Retention (Technical Note #2)” (Putting Client Assessment to Work, SEEP Practitioner Learning Program, The SEEP Network, 2006) (https://seepnetwork.org/Resource-Post/The-Challenges-of-Measuring-Client-Retention). In specific contexts, and based on evidence, this metric may serve as a proxy indicator of whether the outcome being sought by an investor or organization is occurring (the WHAT dimension of impact). For more on the alignment of IRIS metrics to the five dimensions of impact, see IRIS+ and the Five Dimensions of Impact (https://iris.thegiin.org/document/iris-and-the-five-dimensions/). No single metric is sufficient to understand an impact; rather, metrics are selected as a set across all dimensions of impact. When possible, the selection of metrics to measure and describe the five dimensions should be based on best practice and evidence.
defined by: giin

Client Individuals: Active
type: Concept
type: Code
has name: Client Individuals: Active
has description: Number of unique individuals who were active clients of the organization as of the end of the reporting period.
definition: Number of unique individuals who were active clients of the organization as of the end of the reporting period.
has identifier: PI9327
notation: PI9327
had primary source: PI9327
note: Organizations should footnote all assumptions used, including source of data. See usage guidance for further information.
scope note: NOTE: This metric will be deprecated in a forthcoming update to the IRIS Catalog of Metrics. Users are advised to instead report Client Individuals: Total (PI4060) disaggregated by Active Use (PI7985). This metric is intended to capture the number of unique clients who were active users of the organization’s services as of the end of the reporting period; this metric is more relevant to organizations providing services than to those providing products. Organizations wishing to report total client transactions should refer to Client Transactions (PI5184) and related submetrics. Organizations wishing to report the number of unique clients during the course of the reporting period can report on Client Individuals: Total (PI4060) and related submetrics. For financial institutions (including microfinance institutions), this metric would include the number of individuals who currently have outstanding loan balances with the organization. For those financial institutions offering deposit products, this metric would include the number of individuals who have active deposit accounts with the organization. For those financial institutions offering insurance products, this metric would include those with active insurance policies. In all cases, the reported number should be based on the number of individuals, rather than the number of groups or number of active policies/accounts. The definition of active may vary by offering. For example, for traditional financial services, “active” may include all individuals who have accounts registered in their names for at least six months and who have used their accounts to make transactions within the prior six months. For digital financial services, “active” may include individuals who have had accounts registered in their names for at least three months and who have used their accounts to make transactions within the prior three months. This metric is intended to capture the unique number of specific individuals served. Organizations s…
defined by: giin

Distributor Organizations: SME
type: Concept
type: Code
has name: Distributor Organizations: SME
has description: Number of small and medium-sized enterprises (SMEs) that served as distributors of the organization’s products/services during the reporting period.
definition: Number of small and medium-sized enterprises (SMEs) that served as distributors of the organization’s products/services during the reporting period.
has identifier: PI9401
notation: PI9401
had primary source: PI9401
note: Organizations should footnote all assumptions used.
scope note: This metric is intended to capture how many small and medium-sized enterprises sold the organization’s products or services during the reporting period, either to other distributors (wholesale) or to ultimate consumers (retail). Distributors counted under this metric need not exclusively sell the organization’s products or services. This metric is multi-dimensional with regard to the five dimensions of impact: it may help describe the WHO dimension when the stakeholder group represented by the metric is the stakeholder group targeted by the investment or organization. It may also help measure the HOW MUCH Scale dimension, which helps estimate the number of the targeted stakeholders experiencing the outcome. For more on the alignment of IRIS metrics to the five dimensions of impact, see IRIS+ and the Five Dimensions of Impact (https://iris.thegiin.org/document/iris-and-the-five-dimensions/). No single metric is sufficient to understand an impact; rather, metrics are selected as a set across all dimensions of impact. When possible, the selection of metrics to measure and describe the five dimensions should be based on best practice and evidence.
defined by: giin

Client Income
type: Concept
type: Code
has name: Client Income
has identifier: PI9409
notation: PI9409
had primary source: PI9409
note: Organizations should footnote all assumptions used, including source of disaggregation, as well as method for gathering related data (e.g., survey to a sample set of clients, survey to all clients, data gathered as part of client intake form). Organizations should disclose whether clients are reporting changes in pre- or post-tax income and ensure consistency across samples and reporting periods.
scope note: This disaggregation, applied to another metric, is intended to capture the share of that metric which applies to each selected category of change in client income. Organizations should obtain this data by asking clients whether their income has increased a lot (double or more), increased a little (less than double), decreased, or stayed the same during the reporting period. Organizations should report the number of clients in each category: large increase, small increase, decrease, and no change in income. Organizations may report both the total number of clients per category (e.g., total number of clients with a large increase, small increase, decrease, and no change in income) and the proportion or percentage in each category compared to the total number of clients. In specific contexts, and based on evidence, this metric may serve as a proxy indicator of whether the outcome being sought by an investor or organization is occurring (the WHAT dimension of impact). For more on the alignment of IRIS metrics to the five dimensions of impact, see IRIS+ and the Five Dimensions of Impact (https://iris.thegiin.org/document/iris-and-the-five-dimensions/). No single metric is sufficient to understand an impact; rather, metrics are selected as a set across all dimensions of impact. When possible, the selection of metrics to measure and describe the five dimensions should be based on best practice and evidence.
has description: Disaggregates another metric in terms of client income. For example, Client Individuals (PI4060) disaggregated by this metric would yield the number of clients with increased, decreased, or no change in income. See usage guidance for further information. Report all: - Large increase in income (double or more) - Small increase in income (less than doubled) - Decrease in income - No change in income - Data not available - Other (write-in)
definition: Disaggregates another metric in terms of client income. For example, Client Individuals (PI4060) disaggregated by this metric would yield the number of clients with increased, decreased, or no change in income. See usage guidance for further information. Report all: - Large increase in income (double or more) - Small increase in income (less than doubled) - Decrease in income - No change in income - Data not available - Other (write-in)
defined by: giin

Average Client Agriculture Yield: Smallholder
type: Concept
type: Code
has name: Average Client Agriculture Yield: Smallholder
has description: Average agricultural yield per hectare of clients (who were smallholder farmers) of the organization during the reporting period.
definition: Average agricultural yield per hectare of clients (who were smallholder farmers) of the organization during the reporting period.
has identifier: PI9421
notation: PI9421
had primary source: PI9421
note: Organizations should footnote all assumptions used, including source of data and unit of measure reporting against (such as kilograms or bushels per hectare) using Unit of Measure (PD1602).
scope note: NOTE: This metric will be deprecated in a forthcoming update to the IRIS Catalog of Metrics. Users are advised to instead report Average Agricultural Yield (PI5935), applied to Client Individuals: Smallholder (PI6372). This metric is intended to capture the average output per hectare for smallholder farmers among an organization's clients. Organizations should not calculate this metric using aggregate data across all smallholder farmers. Rather, as noted in the calculation, organizations should use smallholder farmer–specific data. Organizations should report yield from the most recent harvest and footnote details on the unit of measure. This metric could be valuable for organizations that sell inputs (such as fertilizer or irrigation equipment) to smallholder farmers that help improve yields. Organizations interested in reporting the yields of supplier farmers should report Average Supplier Agricultural Yield: Smallholder (PI1405). This metric is multi-dimensional with regard to the five dimensions of impact. In specific contexts, and based on evidence, this metric may serve as a proxy indicator of whether the outcome being sought by an investor or organization is occurring (the WHAT dimension of impact). This metric may also identify a specific the WHO dimension subdimension of impact, which details which stakeholders the investment or enterprise aims to reach with the outcome. This metric may also help clarify how underserved they were prior to the investment. For more on the alignment of IRIS metrics to the five dimensions of impact, see IRIS+ and the Five Dimensions of Impact (https://iris.thegiin.org/document/iris-and-the-five-dimensions/). No single metric is sufficient to understand an impact; rather, metrics are selected as a set across all dimensions of impact. When possible, the selection of metrics to measure and describe the five dimensions should be based on best practice and evidence.
defined by: giin

Units/Volume Purchased from Supplier Individuals: Female
type: Concept
type: Code
has name: Units/Volume Purchased from Supplier Individuals: Female
has description: Units/volume purchased from female individuals who sold to the organization during the reporting period.
definition: Units/volume purchased from female individuals who sold to the organization during the reporting period.
has identifier: PI9428
notation: PI9428
had primary source: PI9428
note: Organizations should footnote all assumptions used, including source of data.
scope note: This metric is intended to capture the total units or volume an organization purchased during the reporting period from suppliers who are female individuals. Organizations that purchase different types of products/services should consider reporting separately against each different type of product/service. Organizations may wish to use this metric in conjunction with Supplier Individuals: Female (PI1728).
defined by: giin

Client Complaint Tracking System
type: Concept
type: Code
has name: Client Complaint Tracking System
has description: Indicates whether the organization has a system in place to receive and resolve client complaints.
definition: Indicates whether the organization has a system in place to receive and resolve client complaints.
has identifier: PI9435
notation: PI9435
had primary source: PI9435
note: Organizations should footnote the details of how they receive and handle client complaints. See usage guidance for further information.
scope note: This metric is intended to capture whether the organization has a system to receive and process complaints and other feedback from clients. In educational contexts, clients can refer to students. In health care contexts, clients refers to patients, and in housing contexts, clients refers to residents or tenants. A complaint tracking system is a way for clients to provide feedback, ask questions, and file complaints that is broadly recognized and promoted by the organization and of which most or all clients/customers are aware. Examples, which should be footnoted, may include products that have an email address or phone number for customer feedback listed on their packaging, an organization that has a client feedback link displayed on its website, or an organization that includes a client feedback number on its invoices or contract agreements. With respect to the resolution of complaints, organizations should footnote their system for tracking how and when complaints were addressed. Organizations should consider reporting this metric in conjunction with Complaints Ratio (PI5216) and Number of Complaints Registered (PI2197). In educational contexts, this metric can be used to indicate whether the school or program has a system for receiving student reports about bullying and addressing those complaints. For more information on anti-bullying policies, see U.S. Department of Health and Human Services, Stopbullying.org, “How to Prevent Bullying: Set Policies & Rules” (https://www.stopbullying.gov/prevention/at-school/rules/index.html).
defined by: giin

Energy Capacity Added
type: Concept
type: Code
has name: Energy Capacity Added
has description: Amount of new energy capacity connected to the grid during the reporting period, measured in MW.
definition: Amount of new energy capacity connected to the grid during the reporting period, measured in MW.
has identifier: PI9448
notation: PI9448
had primary source: PI9448
note: Organizations should footnote all assumptions used.
scope note: This metric is intended to capture the amount of new energy capacity – that is, the maximum amount of renewable energy that the organization’s power system can transmit – added to the system during the reporting period. This metric should be reported and disaggregated according to Primary Energy Source (OI3781).
defined by: giin

Job Placements
type: Concept
type: Code
has name: Job Placements
has description: Number of the organization's clients who were placed in part-time, full-time, temporary, or permanent jobs during the reporting period.
definition: Number of the organization's clients who were placed in part-time, full-time, temporary, or permanent jobs during the reporting period.
has identifier: PI9465
notation: PI9465
had primary source: PI9465
note: Organizations should footnote all assumptions used. See usage guidance for further information.
scope note: This metric is intended to capture the number of clients of the organization who were placed in jobs of any type during the reporting period. This metric, which is used to calculate Job Placement Rate (PI3527), may be particularly relevant to organizations that provide clients (for example, students) with vocational/technical training or employment services. Organizations should include only those clients who were placed in and began jobs during the reporting period and exclude clients who were placed in jobs but did not begin work. For work integrating social enterprises (WISE), a high job placement rate is an indicator of success. High rates of voluntary turnover can also be an indicator of success along these lines, which organizations can capture using Employee Voluntary Turnover Rate (OI1638). Organizations are also encouraged to provide details on the types of activities they conducted to increase job placement rates, such as (but not limited to): monitoring workforce trends to ensure alignment between program offerings and workforce needs, surveying employers (to capture position offerings, skills needed, and likely wages), strengthening relationships with potential employers, providing resources (such as interview tips, career fairs, and job leads) to assist job searches and career development, and creating program alumni networks. This metric is multi-dimensional with regard to the five dimensions of impact. In some contexts, this metric can serve as an indicator of whether the outcome being sought by an investor or organization is occurring (the WHAT dimension of impact). It may also help measure the HOW MUCH Scale dimension, which helps estimate the number of the targeted stakeholders experiencing the outcome. For more on the alignment of IRIS metrics to the five dimensions of impact, see IRIS+ and the Five Dimensions of Impact (https://iris.thegiin.org/document/iris-and-the-five-dimensions/). No single metric is sufficient to understand an impact; rather…
defined by: giin

Gender Ratio of Promotions
type: Concept
type: Code
has name: Gender Ratio of Promotions
has description: Ratio between the number of female employees promoted from within the organization and the number of non-female employees promoted from within the organization during the reporting period.
definition: Ratio between the number of female employees promoted from within the organization and the number of non-female employees promoted from within the organization during the reporting period.
has identifier: PI9467
notation: PI9467
had primary source: PI9467
note: Organizations should footnote all assumptions used.
scope note: This metric is intended to capture what proportion of employees promoted within an organization during the reporting period are women. Organizations are encouraged to footnote the roles and levels in which employees promoted began and ended the reporting period. This metric should exclude Temporary Employees (OI9028). Promotion (or career advancement) is defined as the movement of an employee who already works for the organization to a higher grade level either within the same department or to another department as a result of a change in duties, not a market adjustment in salary. For more, see the Society for Human Resource Management (https://www.shrm.org/resourcesandtools/tools-and-samples/policies/pages/job-posting-policy---staff-promotions.aspx). In specific contexts, and based on evidence, this metric may serve as a proxy indicator of whether the outcome being sought by an investor or organization is occurring (the WHAT dimension of impact). For more on the alignment of IRIS metrics to the five dimensions of impact, see IRIS+ and the Five Dimensions of Impact (https://iris.thegiin.org/document/iris-and-the-five-dimensions/). No single metric is sufficient to understand an impact; rather, metrics are selected as a set across all dimensions of impact. When possible, the selection of metrics to measure and describe the five dimensions should be based on best practice and evidence.
defined by: giin

Water Provided for Sale: Total
type: Concept
type: Code
has name: Water Provided for Sale: Total
has description: Volume of water provided and delivered to offtaker(s) during the reporting period.
definition: Volume of water provided and delivered to offtaker(s) during the reporting period.
has identifier: PI9468
notation: PI9468
had primary source: PI9468
note: Organizations should footnote all assumptions used.
scope note: This metric is intended to capture the amount of water the organization produced or provided for commercial sale and not water produced for its own consumption. Bulk water production is usually sold to a utility. The buyer or purchaser of this water is termed the offtaker. Organizations wishing to report product-level water production should use Water Provision Capacity of Products Sold: Total (PD2020) and Water Provision Capacity of Product: Total (PD6052).
defined by: giin

Supplier Organizations: SME
type: Concept
type: Code
has name: Supplier Organizations: SME
has description: Number of small and medium-sized enterprises (SMEs) that sold goods or services to the organization during the reporting period.
definition: Number of small and medium-sized enterprises (SMEs) that sold goods or services to the organization during the reporting period.
has identifier: PI9495
notation: PI9495
had primary source: PI9495
note: Organizations should footnote all assumptions used.
scope note: This metric is intended to capture information about the small and medium-sized enterprises that supply goods or services to the reporting organization. Organizations can themselves determine the precise threshold at which they report suppliers. In most cases, organizations should include only those enterprises supplying goods and services that are fundamental to the operations of the reporting organization. Organizations should not include subcontractors as part of this metric; subcontractors can be reported under Temporary Employees (OI9028) and its related submetrics. This metric is multi-dimensional with regard to the five dimensions of impact: it may help describe the WHO dimension when the stakeholder group represented by the metric is the stakeholder group targeted by the investment or organization. It may also help measure the HOW MUCH Scale dimension, which helps estimate the number of the targeted stakeholders experiencing the outcome. For more on the alignment of IRIS metrics to the five dimensions of impact, see IRIS+ and the Five Dimensions of Impact (https://iris.thegiin.org/document/iris-and-the-five-dimensions/). No single metric is sufficient to understand an impact; rather, metrics are selected as a set across all dimensions of impact. When possible, the selection of metrics to measure and describe the five dimensions should be based on best practice and evidence.
defined by: giin

Distributor Individuals: Poor
type: Concept
type: Code
has name: Distributor Individuals: Poor
has description: Number of poor individuals who served as distributors of the organization’s products/services during the reporting period.
definition: Number of poor individuals who served as distributors of the organization’s products/services during the reporting period.
has identifier: PI9516
notation: PI9516
had primary source: PI9516
note: Organizations should footnote all assumptions used, including details on the assessment tools used to identify the poverty level of distributors. See usage guidance for further information.
scope note: This metric is intended to capture how many self-employed poor individuals sold the organization’s products or services during the reporting period, either to other distributors (wholesale) or to ultimate consumers (retail). This is a measure of how organizations support individuals living in poverty through their distribution chains. Distributors counted under this metric need not exclusively sell the organization's products or services. Direct employees who distribute the organization's goods or services should be considered employees, not distributors. Because assessing the poverty level of stakeholders is complex, organizations will likely have to use specific assessment tools to accurately report on this metric. See the glossary definition for additional information on commonly used tools to help determine the absolute poverty level of individuals and households. This metric is multi-dimensional with regard to the five dimensions of impact: it may help describe the WHO dimension when the stakeholder group represented by the metric is the stakeholder group targeted by the investment or organization. It may also help measure the HOW MUCH Scale dimension, which helps estimate the number of the targeted stakeholders experiencing the outcome. For more on the alignment of IRIS metrics to the five dimensions of impact, see IRIS+ and the Five Dimensions of Impact (https://iris.thegiin.org/document/iris-and-the-five-dimensions/). No single metric is sufficient to understand an impact; rather, metrics are selected as a set across all dimensions of impact. When possible, the selection of metrics to measure and describe the five dimensions should be based on best practice and evidence.
defined by: giin

Ecological Restoration Management Area
type: Concept
type: Code
has name: Ecological Restoration Management Area
has description: Area of land under management for ecological restoration during the reporting period, whether directly or indirectly controlled by the organization.
definition: Area of land under management for ecological restoration during the reporting period, whether directly or indirectly controlled by the organization.
has identifier: PI9556
notation: PI9556
had primary source: PI9556
note: Organizations should footnote all assumptions used, as well as relevant ecological restoration activities undertaken during the reporting period.
scope note: This metric is intended to capture the entire area of land under ecological restoration during the reporting period, not just any additional area of land that began restoration during the reporting period. Organizations are encouraged to report this metric in conjunction with Land Directly Controlled: Total (OI5408) and Land Indirectly Controlled: Total (PI3789). Effective management of biodiversity restoration and conservation requires clearly defining which areas are under management, as the scale and connectivity of the areas may affect which management measures are required. Organizations should consider the types of land use adjacent to the managed area concerned, as the effects of land use may extend into protected areas. Organizations should footnote details on the key measures, methods, and targets used in managing restoration, including surface, species, habitat types, vegetation types, and relief. Organizations are encouraged to perform detailed inventories of relevant data, linked to specific, persistent sampling locations through GPS and GIS software. Organizations are also encouraged to link existing maps and remote sensing data to these data on biotic and abiotic factors in the area.
defined by: giin

Supplier Organizations: Total
type: Concept
type: Code
has name: Supplier Organizations: Total
has description: Number of enterprises that sold goods or services to the organization during the reporting period.
definition: Number of enterprises that sold goods or services to the organization during the reporting period.
has identifier: PI9566
notation: PI9566
had primary source: PI9566
note: Organizations should footnote all assumptions used.
scope note: This metric is intended to capture how many enterprises supply goods or services to the reporting organization. Organizations can themselves determine the precise threshold at which they report suppliers. In most cases, organizations should include only those enterprises supplying goods and services that are fundamental to the operations of the reporting organization. Organizations should not include subcontractors as part of this metric; subcontractors can be reported under Temporary Employees (OI9028) and its related submetrics. This metric is multi-dimensional with regard to the five dimensions of impact: it may help describe the WHO dimension when the stakeholder group represented by the metric is the stakeholder group targeted by the investment or organization. It may also help measure the HOW MUCH Scale dimension, which helps estimate the number of the targeted stakeholders experiencing the outcome. For more on the alignment of IRIS metrics to the five dimensions of impact, see IRIS+ and the Five Dimensions of Impact (https://iris.thegiin.org/document/iris-and-the-five-dimensions/). No single metric is sufficient to understand an impact; rather, metrics are selected as a set across all dimensions of impact. When possible, the selection of metrics to measure and describe the five dimensions should be based on best practice and evidence.
defined by: giin

Client Individuals: Receiving Free Products/Services
type: Concept
type: Code
has name: Client Individuals: Receiving Free Products/Services
has description: Number of unique client individuals who received free products/services from the organization during the reporting period.
definition: Number of unique client individuals who received free products/services from the organization during the reporting period.
has identifier: PI9622
notation: PI9622
had primary source: PI9622
note: Organizations should footnote all assumptions used, including source of data. See usage guidance for further information.
scope note: This metric is intended to capture all unique clients who received products or services provided by the organization for which it did not request payment and for which it does not expect reimbursement. If the organization expects or receives payment from someone other than the client, these client individuals should be reported against Client Individuals: No Direct Payment (PI1807). This metric is intended to measure clients receiving free products/services that are core to the operations of the organization providing them; for example, some healthcare clinics provide free health check-ups. Organizations should include the number of unique client individuals who received free products or services, regardless of whether or not these same individuals also paid the organization for certain products or services during the reporting period. This metric is intended to capture the unique number of specific individuals served. Organizations should not use any household multipliers when reporting against this metric. If organizations consider entire households to be the customer/client, they can report against Client Households: Total (PI7954) and its associated submetrics. Many organizations may not be able to report on the number of clients using direct data. For example, organizations that sell solar lanterns through a series of local network distributors might estimate the number of client individuals reached based on the number of units sold. Organizations should footnote details on how and why these assumptions were made. For healthcare providers, “client individuals” refers to patients. For housing providers, “client individuals” refers to residents or tenants. This metric is multi-dimensional with regard to the five dimensions of impact. It may help describe the WHO dimension when the stakeholder group represented by the metric is the stakeholder group targeted by the investment or organization. It may also help measure the HOW MUCH Scale dimension, which helps estim…
defined by: giin

Target Stakeholder Spending: Total
type: Concept
type: Code
has name: Target Stakeholder Spending: Total
has description: Average amount of money spent by target stakeholders during the reporting period.
definition: Average amount of money spent by target stakeholders during the reporting period.
has identifier: PI9626
notation: PI9626
had primary source: PI9626
note: Organizations should footnote all assumptions used, including source of data.
scope note: This metric is intended to capture the average total spending by target stakeholders on all goods and services. These data can be collected directly from target stakeholders through a survey. Organizations should footnote details on the sample size and survey instrument used, as well as details on who administered the survey and who aggregated the resulting data. In some contexts, this metric can serve as an indicator of whether the outcome being sought by an investor or organization is occurring (the WHAT dimension of impact). For more on the alignment of IRIS metrics to the five dimensions of impact, see IRIS+ and the Five Dimensions of Impact (https://iris.thegiin.org/document/iris-and-the-five-dimensions/). No single metric is sufficient to understand an impact; rather, metrics are selected as a set across all dimensions of impact. When possible, the selection of metrics to measure and describe the five dimensions should be based on best practice and evidence.
defined by: giin

Client Organizations: Total
type: Concept
type: Code
has name: Client Organizations: Total
has description: Number of enterprises that were clients of the organization during the reporting period.
definition: Number of enterprises that were clients of the organization during the reporting period.
has identifier: PI9652
notation: PI9652
had primary source: PI9652
note: Organizations should footnote all assumptions used, including source of data. Organizations should also footnote the types of enterprises that were clients, using Client Type (PD7993).
scope note: This metric is intended to capture the number of unique client organizations (enterprises) of the reporting organization during the reporting period. This metric is multi-dimensional with regard to the five dimensions of impact. It may help describe the WHO dimension when the stakeholder group represented by the metric is the stakeholder group targeted by the investment or organization. It may also help measure the HOW MUCH Scale dimension, which helps estimate the number of the targeted stakeholders experiencing the outcome. For more on the alignment of IRIS metrics to the five dimensions of impact, see IRIS+ and the Five Dimensions of Impact (https://iris.thegiin.org/document/iris-and-the-five-dimensions/). No single metric is sufficient to understand an impact; rather, metrics are selected as a set across all dimensions of impact. When possible, the selection of metrics to measure and describe the five dimensions should be based on best practice and evidence.
defined by: giin

Earnings of Distributor Individuals: Historically Marginalized
type: Concept
type: Code
has name: Earnings of Distributor Individuals: Historically Marginalized
has description: Earnings of individuals who belong to groups historically marginalized due to race and/or ethnicity as a result of selling the organization’s products/services during the reporting period.
definition: Earnings of individuals who belong to groups historically marginalized due to race and/or ethnicity as a result of selling the organization’s products/services during the reporting period.
has identifier: PI9654
notation: PI9654
had primary source: PI9654
note: Organizations should footnote all assumptions used, including their categorization of historically marginalized groups.
scope note: This metric is intended to capture the total gross margin earned by, or commission paid to, individual distributors who belong to a group historically marginalized due to race and/or ethnicity, a measure of how organizations support the livelihoods of individuals in those groups through their distribution chains. The categorization of historically marginalized groups varies with location and context. With no internationally agreed-upon definition as to which groups constitute historically marginalized due to race and/or ethnicity, if well-established local policies exist (as in South Africa, with the Broad Based Black Economic Empowerment [BBBEE] definition of historically marginalized, or in India, based on backward caste), organizations should refer to these local guidelines to identify groups historically marginalized due to race and/or ethnicity. Otherwise, and wherever appropriate, organizations should provide additional detail regarding their tailored methodology for defining these groups.
defined by: giin

Earnings of Distributor Individuals: Urban
type: Concept
type: Code
has name: Earnings of Distributor Individuals: Urban
has description: Earnings of individual distributors residing in urban areas as a result of selling the organization’s products/services during the reporting period.
definition: Earnings of individual distributors residing in urban areas as a result of selling the organization’s products/services during the reporting period.
has identifier: PI9676
notation: PI9676
had primary source: PI9676
note: Organizations should footnote all assumptions used.
scope note: This metric is intended to capture the total gross margin earned by, or commission paid to, individual urban distributors, a measure of how organizations support the livelihoods of urban individuals through their distribution chains.
defined by: giin

Client Organizations: Microenterprises
type: Concept
type: Code
has name: Client Organizations: Microenterprises
has description: Number of microenterprises that were clients of the organization during the reporting period.
definition: Number of microenterprises that were clients of the organization during the reporting period.
has identifier: PI9713
notation: PI9713
had primary source: PI9713
note: Organizations should footnote all assumptions used, including source of data. Organizations should also footnote the types of enterprises that were clients, using Client Type (PD7993).
scope note: This metric is intended to capture the number of unique client microenterprises of the reporting organization during the reporting period. The IFC defines a microenterprise as one that meets two of the following three criteria: fewer than 10 employees, below USD 100,000 in assets, or less than USD 100,000 in annual sales. See “IFC Definition of Targeted Sectors” (https://www.ifc.org/wps/wcm/connect/industry_ext_content/ifc_external_corporate_site/financial+institutions/priorities/ifcs+definitions+of+targeted+sectors). This metric is multi-dimensional with regard to the five dimensions of impact. It may help describe the WHO dimension when the stakeholder group represented by the metric is the stakeholder group targeted by the investment or organization. It may also help measure the HOW MUCH Scale dimension, which helps estimate the number of the targeted stakeholders experiencing the outcome. For more on the alignment of IRIS metrics to the five dimensions of impact, see IRIS+ and the Five Dimensions of Impact (https://iris.thegiin.org/document/iris-and-the-five-dimensions/). No single metric is sufficient to understand an impact; rather, metrics are selected as a set across all dimensions of impact. When possible, the selection of metrics to measure and describe the five dimensions should be based on best practice and evidence.
defined by: giin

Client Individuals: Very Poor
type: Concept
type: Code
has name: Client Individuals: Very Poor
has description: Number of unique very poor individuals who were clients of the organization during the reporting period.
definition: Number of unique very poor individuals who were clients of the organization during the reporting period.
has identifier: PI9835
notation: PI9835
had primary source: PI9835
note: Organizations should footnote all assumptions used, including source of data, as well as details on the assessment tools used to identify clients’ poverty level. See usage guidance for further information.
scope note: This metric is intended to capture the number of unique very poor clients who received the organization's products or services during the reporting period. It is not a measure of foot traffic, nor is it intended to capture the number of consumer transactions. For example, a customer who makes two purchases during a period should be counted only once. Organizations wishing to report on total client transactions should refer to Client Transactions (PI5184). Because assessing the poverty level of stakeholders is complex, organizations will likely use specific assessment tools to accurately report on this metric. See the glossary definition for additional information on commonly used tools to help determine the absolute poverty level of individuals and households. This metric is intended to capture the unique number of specific individuals served. Organizations should not use any household multipliers when reporting against this metric. If organizations consider entire households to be the customer/client, they can report against Client Households: Total (PI7954) and its associated submetrics. Many organizations may not be able to report on the number of clients using direct data. For example, organizations that sell solar lanterns through a series of local network distributors might estimate the number of client individuals reached based on the number of units sold. Organizations should footnote details on how and why these assumptions were made. For healthcare providers, “client individuals” refers to patients. For housing providers, “client individuals” refers to residents or tenants. This metric is multi-dimensional with regard to the five dimensions of impact. It may help describe the WHO dimension when the stakeholder group represented by the metric is the stakeholder group targeted by the investment or organization. It may also help measure the HOW MUCH Scale dimension, which helps estimate the number of the targeted stakeholders experiencing the outcome. For mor…
defined by: giin

Payments to Supplier Individuals: Peri-Urban
type: Concept
type: Code
has name: Payments to Supplier Individuals: Peri-Urban
has description: Value of payments made by the organization to individuals residing in peri-urban areas who sold goods or services to the organization during the reporting period.
definition: Value of payments made by the organization to individuals residing in peri-urban areas who sold goods or services to the organization during the reporting period.
has identifier: PI9850
notation: PI9850
had primary source: PI9850
note: Organizations should footnote all assumptions used.
scope note: This metric is intended to be used by organizations who seek to support individuals residing in peri-urban areas through their supply chains.
defined by: giin

Client Dropout Reasons
type: Concept
type: Code
has name: Client Dropout Reasons
has description: Describes main reasons clients drop out of a service or program (e.g., time constraints, financial constraints, disinterest).
definition: Describes main reasons clients drop out of a service or program (e.g., time constraints, financial constraints, disinterest).
has identifier: PI9872
notation: PI9872
had primary source: PI9872
note: Organizations should footnote all assumptions used, including source of data, as well as the complete categorization of reasons for dropping out.
scope note: This metric is intended to capture detailed reasons for client turnover, such as financial constraints, disinterest, business failure, receiving a more attractive offer from a competitor, or external factors. Organizations should disclose both the total number of clients that dropped out during the period and the share of clients citing each primary reason for dropping out.
defined by: giin

Greenhouse Gas Emissions Sequestered
type: Concept
type: Code
has name: Greenhouse Gas Emissions Sequestered
has description: Amount of greenhouse gas (GHG) emissions sequestered by the organization during the reporting period.
definition: Amount of greenhouse gas (GHG) emissions sequestered by the organization during the reporting period.
has identifier: PI9878
notation: PI9878
had primary source: PI9878
note: Organizations should footnote all assumptions used, including detailed information on calculation methodology and source of data. See usage guidance for further information.
scope note: This metric is intended to capture the total amount of GHG emissions sequestered during the reporting period. Organizations should use this metric in combination with Greenhouse Gas Emissions Mitigation Types (OI9839) in order to disaggregate the types of GHG emissions sequestered that are relevant to the organization's activities. This metric refers to GHG emissions sequestered during the reporting period, not over the lifetime of trees or forestland, for example. Greenhouse gas emissions are anthropogenic drivers of climate change, which alters species’ habitats. Species that cannot migrate or adapt become extinct, leading to worldwide decline in biodiversity and ecosystem services. Restoring carbon sinks such as forests and peatlands can help mitigate climate change by sequestering carbon. Calculating GHG emissions sequestration is technical and requires standardized, precise methodological guidance. Organizations should refer to at least one of the following standards when calculating this metric: Verified Carbon Standard, Gold Standard, American Carbon Registry, AFOLU Carbon Calculator, Climate Action Reserve Standard, and Plan Vivo Standard. For tools that may be helpful in calculating this and related metrics, see the GHG Protocol Calculators (https://ghgprotocol.org/calculation-tools). This metric is multi-dimensional with regard to the five dimensions of impact. In some contexts, this metric can serve as an indicator of whether the outcome being sought by an investor or organization is occurring (the WHAT dimension of impact). It may also help measure the HOW MUCH Scale dimension, which helps estimate the number of the targeted stakeholders experiencing the outcome. For more on the alignment of IRIS metrics to the five dimensions of impact, see IRIS+ and the Five Dimensions of Impact (https://iris.thegiin.org/document/iris-and-the-five-dimensions/). No single metric is sufficient to understand an impact; rather, metrics are selected as a set across all dime…
defined by: giin

Promptness of Claims Settlement
type: Concept
type: Code
has name: Promptness of Claims Settlement
has description: Average number of days elapsed between the occurrence of an insured incident and the receipt of payment or claim denial by the stakeholder (client of the organization), for all claims settled (or rejected) during the reporting period.
definition: Average number of days elapsed between the occurrence of an insured incident and the receipt of payment or claim denial by the stakeholder (client of the organization), for all claims settled (or rejected) during the reporting period.
has identifier: PI9897
notation: PI9897
had primary source: PI9897
note: Organizations should footnote all assumptions used, as well as the details of the schedule of claims settlement (since an acceptable timeline can vary by geography). See usage guidance for further information.
scope note: This metric is intended to capture how long on average (in days) it takes the organization to settle claims, measured from the date of the insured incident. Organizations should calculate this metric using the average days’ duration between the date of an insured incident and the date that the affected stakeholder receives payment or claim denial. Organizations should footnote a schedule outlining the number of claims settled within specified durations. In this regard, organizations are encouraged to report the number of claims settled within the timeline breakouts recommended by the Microinsurance Network: 7 days, 8–30 days, 31–90 days, and more than 90 days. Where applicable, organizations should note how duration ranges change to match regional norms. It is not always possible to determine how long it takes for payment to reach the affected stakeholder (i.e., the date benefits were received). In these cases, organizations should estimate using the date on which the claim was paid, footnoting these assumptions. For more detail on the Promptness of Claims Settlement and the recommended footnote schedule, as well as for guidance on interpretation, see the Microinsurance Network's Social Performance Indicators for Microinsurance, p. 19 (https://www.social-protection.org/gimi/ShowRessource.action?id=5270).
defined by: giin

Student Dropout Rate
type: Concept
type: Code
has name: Student Dropout Rate
has description: Percentage of students who were attending school at the beginning of the reporting period but who dropped out during the reporting period.
definition: Percentage of students who were attending school at the beginning of the reporting period but who dropped out during the reporting period.
has identifier: PI9910
notation: PI9910
had primary source: PI9910
note: Organizations should footnote all assumptions used, as well as any relevant details regarding the dropout rate.
scope note: This metric is intended to capture the percentage of students who left school permanently during the reporting period. For example, if 10 students enrolled in Grade Five and nine have finished as of the end of the reporting period (meaning that one student dropped out), the student dropout rate is calculated as 1/10 = 10%. This metric differs from Student Promotion Rate (PI4924), which captures students proceeding a higher grade of schooling during the reporting period. This metric aligns with the UNESCO Institute for Statistics Indicator "Dropout Rate by Grade (PR)" (http://uis.unesco.org/sites/default/files/documents/education-indicators-technical-guidelines-en_0.pdf). This metric is multi-dimensional with regard to the five dimensions of impact. In some contexts, this metric can serve as an indicator of whether the outcome being sought by an investor or organization is occurring (the WHAT dimension of impact). It may also help measure the HOW MUCH Scale dimension, which helps estimate the number of the targeted stakeholders experiencing the outcome. For more on the alignment of IRIS metrics to the five dimensions of impact, see IRIS+ and the Five Dimensions of Impact (https://iris.thegiin.org/document/iris-and-the-five-dimensions/). No single metric is sufficient to understand an impact; rather, metrics are selected as a set across all dimensions of impact. When possible, the selection of metrics to measure and describe the five dimensions should be based on best practice and evidence.
defined by: giin

Earnings of Distributor Individuals: Peri-urban
type: Concept
type: Code
has name: Earnings of Distributor Individuals: Peri-urban
has description: Value of payments made by the organization to individuals residing in peri-urban areas who sold goods or services to the organization during the reporting period.
definition: Value of payments made by the organization to individuals residing in peri-urban areas who sold goods or services to the organization during the reporting period.
has identifier: PI9973
notation: PI9973
had primary source: PI9973
note: Organizations should footnote all assumptions used.
scope note: This metric is intended to capture how organizations support the livelihoods of individuals residing in peri-urban areas through their supply chains.
defined by: giin

Purchase Contracts
type: Concept
type: Code
has name: Purchase Contracts
has description: Number of contracts and purchase agreements that the organization holds for purchase of its products/services. Disaggregate by contracts fulfilled and contracts outstanding as of the end of the reporting period.
definition: Number of contracts and purchase agreements that the organization holds for purchase of its products/services. Disaggregate by contracts fulfilled and contracts outstanding as of the end of the reporting period.
has identifier: PI9988
notation: PI9988
had primary source: PI9988
note: Organizations should footnote relevant details about the purchase contracts.
scope note: This metric is intended to capture the number of buyers or clients with which the organization has a written agreement, contract, or ongoing business relationship as of the end of the reporting period.
defined by: giin

Supplier Individuals: Smallholder
type: Concept
type: Code
has name: Supplier Individuals: Smallholder
has description: Number of smallholder farmer individuals who sold to the organization during the reporting period.
definition: Number of smallholder farmer individuals who sold to the organization during the reporting period.
has identifier: PI9991
notation: PI9991
had primary source: PI9991
note: Organizations should footnote all assumptions used, including source of data.
scope note: This metric is intended to capture the number of smallholder suppliers of the organization during the reporting period. This metric is intended for use by organizations that seek to support smallholder farmer individuals through their supply chains. This metric is multi-dimensional with regard to the five dimensions of impact: it may help describe the WHO dimension when the stakeholder group represented by the metric is the stakeholder group targeted by the investment or organization. It may also help measure the HOW MUCH Scale dimension, which helps estimate the number of the targeted stakeholders experiencing the outcome. For more on the alignment of IRIS metrics to the five dimensions of impact, see IRIS+ and the Five Dimensions of Impact (https://iris.thegiin.org/document/iris-and-the-five-dimensions/). No single metric is sufficient to understand an impact; rather, metrics are selected as a set across all dimensions of impact. When possible, the selection of metrics to measure and describe the five dimensions should be based on best practice and evidence.
defined by: giin

Provided New Access
type: Concept
type: Code
has name: Provided New Access
has identifier: PI9996
notation: PI9996
had primary source: PI9996
note: Organizations should footnote all assumptions used, including source of data or disaggregation and any other disaggregations applied.
scope note: This metric is intended to capture a description of the type of prior access available to the organization's clients from among the options given in the definition. Organizations can report this metric at an organizational level (selecting all product/services that apply) or for a specific product/service (selecting the product/service for which the organization is reporting). This disaggregation, applied to another metric, is intended to capture the share of that metric which relates to the selected level(s) of prior access. For example, the disaggregation "Previously accessed dirty energy" when applied to Client Individuals (PI4060) would include the number of client individuals that received new access to clean energy, while the disaggregation "Previously lacked any energy access" applied to the same metric would include the number of client individuals receiving new access to energy.
has description: Describes the type of prior access in a market available to an organization's clients, or disaggregates another metric in terms of type of prior access available in a market. Select any that apply by impact theme: Clean Energy - Previously accessed ‘dirty’ energy - Previously lacked any energy access - Previously accessed less efficient energy - Did not previously lack clean energy access - Other (write-in) Other - Write-in
definition: Describes the type of prior access in a market available to an organization's clients, or disaggregates another metric in terms of type of prior access available in a market. Select any that apply by impact theme: Clean Energy - Previously accessed ‘dirty’ energy - Previously lacked any energy access - Previously accessed less efficient energy - Did not previously lack clean energy access - Other (write-in) Other - Write-in
defined by: giin